<html>
<head>
<meta http-equiv="content-type" content="text/html; charset=ISO-8859-1">
</head>
<body bgcolor="#FFFFFF" text="#000000">
<tt>I am having issues compiling the systemd-image for beaglebone
under Angstrom. I receive the following error message which seems
to state that 'install' is missing, is anyone else having trouble
or could provide some insight to this?<br>
<br>
</tt>
<blockquote><tt>ERROR: Function failed: do_install (see
/home/jack/angstrom/build/tmp-angstrom_2010_x-eglibc/work/armv7a-angstrom-linux-gnueabi/cpufrequtils-008-r3/temp/log.do_install.16223
for further information)</tt><br>
<tt>+ cd
/home/jack/angstrom/build/tmp-angstrom_2010_x-eglibc/work/armv7a-angstrom-linux-gnueabi/cpufrequtils-008-r3/git</tt><br>
<tt>+ do_install</tt><br>
<tt>+ oe_runmake -e install
DESTDIR=/home/jack/angstrom/build/tmp-angstrom_2010_x-eglibc/work/armv7a-angstrom-linux-gnueabi/cpufrequtils-008-r3/image</tt><br>
<tt>+ '[' xmake = x ']'</tt><br>
<tt>+ bbnote make -j12 V=1 CROSS=arm-angstrom-linux-gnueabi-
'LIBTOOL=arm-angstrom-linux-gnueabi-libtool --tag cc'
STRIPCMD=echo -e install
DESTDIR=/home/jack/angstrom/build/tmp-angstrom_2010_x-eglibc/work/armv7a-angstrom-linux-gnueabi/cpufrequtils-008-r3/image</tt><br>
<tt>+ echo 'NOTE: make -j12 V=1 CROSS=arm-angstrom-linux-gnueabi-
LIBTOOL=arm-angstrom-linux-gnueabi-libtool --tag cc
STRIPCMD=echo -e install
DESTDIR=/home/jack/angstrom/build/tmp-angstrom_2010_x-eglibc/work/armv7a-angstrom-linux-gnueabi/cpufrequtils-008-r3/image'</tt><br>
<tt>NOTE: make -j12 V=1 CROSS=arm-angstrom-linux-gnueabi-
LIBTOOL=arm-angstrom-linux-gnueabi-libtool --tag cc
STRIPCMD=echo -e install
DESTDIR=/home/jack/angstrom/build/tmp-angstrom_2010_x-eglibc/work/armv7a-angstrom-linux-gnueabi/cpufrequtils-008-r3/image</tt><br>
<tt>+ make -j12 V=1 CROSS=arm-angstrom-linux-gnueabi-
'LIBTOOL=arm-angstrom-linux-gnueabi-libtool --tag cc'
STRIPCMD=echo -e install
DESTDIR=/home/jack/angstrom/build/tmp-angstrom_2010_x-eglibc/work/armv7a-angstrom-linux-gnueabi/cpufrequtils-008-r3/image</tt><br>
<tt>/usr/bin/install -c -d
/home/jack/angstrom/build/tmp-angstrom_2010_x-eglibc/work/armv7a-angstrom-linux-gnueabi/cpufrequtils-008-r3/image/usr/lib</tt><br>
<tt>/usr/bin/install -c -d
/home/jack/angstrom/build/tmp-angstrom_2010_x-eglibc/work/armv7a-angstrom-linux-gnueabi/cpufrequtils-008-r3/image/usr/bin</tt><br>
<tt>/usr/bin/install -c -m 644 -D man/cpufreq-set.1
/home/jack/angstrom/build/tmp-angstrom_2010_x-eglibc/work/armv7a-angstrom-linux-gnueabi/cpufrequtils-008-r3/image/usr/share/man/man1/cpufreq-set.1</tt><br>
<tt>/usr/bin/install -c -d
/home/jack/angstrom/build/tmp-angstrom_2010_x-eglibc/work/armv7a-angstrom-linux-gnueabi/cpufrequtils-008-r3/image/usr/share/locale</tt><br>
<tt>make: /usr/bin/install: Command not found</tt><br>
<tt>make: *** [install-lib] Error 127</tt><br>
<tt>make: *** Waiting for unfinished jobs....</tt><br>
<tt>make: /usr/bin/install: Command not found</tt><br>
<tt>make: *** [install-gmo] Error 127</tt><br>
<tt>make: /usr/bin/install: Command not found</tt><br>
<tt>make: *** [install-tools] Error 127</tt><br>
<tt>Translating de make: /usr/bin/install: Command not found</tt><br>
<tt>make: *** [install-man] Error 127</tt><br>
<tt>...... done.</tt><br>
<tt>54 translated messages.</tt><br>
<tt>Translating fr ...... done.</tt><br>
<tt>45 translated messages, 7 fuzzy translations, 2 untranslated
messages.</tt><br>
<tt>Translating it ...... done.</tt><br>
<tt>54 translated messages.</tt><br>
<tt>Translating cs ...... done.</tt><br>
<tt>45 translated messages, 7 fuzzy translations, 2 untranslated
messages.</tt><br>
<tt>Translating pt ...... done.</tt><br>
<tt>54 translated messages.</tt><br>
<tt>Translating ca ...... done.</tt><br>
<tt>54 translated messages.</tt><br>
<tt>+ die 'oe_runmake failed'</tt><br>
<tt>+ bbfatal 'oe_runmake failed'</tt><br>
<tt>+ echo 'ERROR: oe_runmake failed'</tt><br>
<tt>ERROR: oe_runmake failed</tt><br>
<tt>+ exit 1</tt><br>
</blockquote>
<tt><br>
Regards,<br>
Jack.<br>
</tt>
</body>
</html>