<div dir="ltr"><div class="gmail_extra"><br><div class="gmail_quote">On 9 June 2017 at 02:39, Fan Xin <span dir="ltr"><<a href="mailto:fan.xin@jp.fujitsu.com" target="_blank">fan.xin@jp.fujitsu.com</a>></span> wrote:<br><blockquote class="gmail_quote" style="margin:0px 0px 0px 0.8ex;border-left-width:1px;border-left-style:solid;border-left-color:rgb(204,204,204);padding-left:1ex"><div id="gmail-:4lu" class="gmail-a3s gmail-aXjCH gmail-m15c8a80d83477b26">-SRC_URI = "${SOURCEFORGE_MIRROR}/<span class="gmail-il">flex</span>/<wbr><span class="gmail-il">flex</span>-${PV}.tar.bz2 \<br>
+SRC_URI = "<a href="https://github.com/westes/flex/files/981163/${PN}-${PV}.tar.gz" rel="noreferrer" target="_blank">https://github.com/westes/<wbr><span class="gmail-il">flex</span>/files/981163/${PN}-${PV}.<wbr>tar.gz</a> \<br>
file://run-ptest \<br>
file://do_not_create_pdf_doc.<wbr>patch \<br>
file://0001-tests-add-a-<wbr>target-for-building-tests-<wbr>without-runnin.patch \<br>
@@ -19,8 +19,8 @@ SRC_URI = "${SOURCEFORGE_MIRROR}/<span class="gmail-il">flex</span>/<wbr><span class="gmail-il">flex</span>-${PV}.tar.bz2 \<br>
${@bb.utils.contains('PTEST_<wbr>ENABLED', '1', '', 'file://disable-tests.patch', d)} \<br>
"</div></blockquote></div><br><div class="gmail_extra">ERROR: flex-native-2.6.4-r0 do_patch: Command Error: 'quilt --quiltrc /data/poky-master/tmp/work/x86_64-linux/flex-native/2.6.4-r0/recipe-sysroot-native/etc/quiltrc push' exited with 0 Output:</div><div class="gmail_extra">Applying patch do_not_create_pdf_doc.patch</div><div class="gmail_extra">patching file doc/Makefile.am</div><div class="gmail_extra">Hunk #1 FAILED at 2.</div><div class="gmail_extra">1 out of 1 hunk FAILED -- rejects in file doc/Makefile.am</div><div class="gmail_extra">Patch do_not_create_pdf_doc.patch does not apply (enforce with -f)</div><div class="gmail_extra">ERROR: flex-native-2.6.4-r0 do_patch: Function failed: patch_do_patch</div><div class="gmail_extra">ERROR: Logfile of failure stored in: /data/poky-master/tmp/work/x86_64-linux/flex-native/2.6.4-r0/temp/log.do_patch.20795</div><div class="gmail_extra">ERROR: Task (virtual:native:/home/ross/Yocto/poky/meta/recipes-devtools/flex/flex_2.6.4.bb:do_patch) failed with exit code '1'</div><div class="gmail_extra">ERROR: flex-2.6.4-r0 do_patch: Command Error: 'quilt --quiltrc /data/poky-master/tmp/work/corei7-64-poky-linux/flex/2.6.4-r0/recipe-sysroot-native/etc/quiltrc push' exited with 0 Output:</div><div class="gmail_extra">Applying patch do_not_create_pdf_doc.patch</div><div class="gmail_extra">patching file doc/Makefile.am</div><div class="gmail_extra">Hunk #1 FAILED at 2.</div><div class="gmail_extra">1 out of 1 hunk FAILED -- rejects in file doc/Makefile.am</div><div class="gmail_extra">Patch do_not_create_pdf_doc.patch does not apply (enforce with -f)</div><div class="gmail_extra">ERROR: flex-2.6.4-r0 do_patch: Function failed: patch_do_patch</div><div class="gmail_extra">ERROR: Logfile of failure stored in: /data/poky-master/tmp/work/corei7-64-poky-linux/flex/2.6.4-r0/temp/log.do_patch.20879</div><div class="gmail_extra">ERROR: Task (/home/ross/Yocto/poky/meta/recipes-devtools/flex/flex_2.6.4.bb:do_patch) failed with exit code '1'</div><div class="gmail_extra"><br></div><div class="gmail_extra">Ross</div></div></div>