<html>
<head>
<meta http-equiv="Content-Type" content="text/html; charset=UTF-8">
</head>
<body>
<p>hello!<br>
</p>
<p>We think this problem has something to do with the host
environment. We tried to reproduce the error on ubuntu16.04 and
fedora29, but they all compiled successfully. Can you tell us
which distributions are having this problem?<br>
<br>
</p>
<div class="moz-cite-prefix">On 10/25/19 8:19 AM, akuster808 wrote:<br>
</div>
<blockquote type="cite"
cite="mid:62d969ba-cf7f-8651-6dd9-e7e71b489c6e@gmail.com">
<meta http-equiv="Content-Type" content="text/html; charset=UTF-8">
<br>
<br>
<div class="moz-cite-prefix">On 10/24/19 6:37 AM, Trevor Gamblin
wrote:<br>
</div>
<blockquote type="cite"
cite="mid:33468050-37e6-a0ef-b95d-039814a52343@windriver.com">
<p>On 10/24/19 9:06 AM, Trevor Woerner wrote:<br>
</p>
<blockquote type="cite"
cite="mid:20191024130641.GA30191@linux-uys3">
<pre class="moz-quote-pre" wrap="">This upgrade caused my build to fail :-(
Is anyone else seeing this?
</pre>
</blockquote>
</blockquote>
<br>
Me too but only on my older ubunto 16.04.<br>
<br>
we should bug this. If no one does by Friday night I will.<br>
<br>
- armin<br>
<blockquote type="cite"
cite="mid:33468050-37e6-a0ef-b95d-039814a52343@windriver.com">
<blockquote type="cite"
cite="mid:20191024130641.GA30191@linux-uys3">
<pre class="moz-quote-pre" wrap="">        22:47:40 | x86_64-linux-libtool: link: gcc -W -Wall -Wshadow -Wformat -Wundef -D_GNU_SOURCE -isystem/z/jenkins-workspace/nightly/cubietruck/build/tmp-glibc/work/x86_64-linux/libcap-ng-native/0.7.10-r0/recipe-sysroot-native/usr/include -O2 -pipe -Wl,--enable-new-dtags -Wl,-rpath-link -Wl,/z/jenkins-workspace/nightly/cubietruck/build/tmp-glibc/work/x86_64-linux/libcap-ng-native/0.7.10-r0/recipe-sysroot-native/usr/lib -Wl,-rpath-link -Wl,/z/jenkins-workspace/nightly/cubietruck/build/tmp-glibc/work/x86_64-linux/libcap-ng-native/0.7.10-r0/recipe-sysroot-native/lib -Wl,-rpath -Wl,/z/jenkins-workspace/nightly/cubietruck/build/tmp-glibc/work/x86_64-linux/libcap-ng-native/0.7.10-r0/recipe-sysroot-native/usr/lib -Wl,-rpath -Wl,/z/jenkins-workspace/nightly/cubietruck/build/tmp-glibc/work/x86_64-linux/libcap-ng-native/0.7.10-r0/recipe-sysroot-native/lib -Wl,-O1 -o .libs/netcap netcap.o proc-llist.o -L/z/jenkins-workspace/nightly/cubietruck/build/tmp-glibc/work/x86_64-linux/libcap-ng-na
tive/0.7.10-r0/recipe-sysroot-native/usr/lib -L/z/jenkins-workspace/nightly/cubietruck/build/tmp-glibc/work/x86_64-linux/libcap-ng-native/0.7.10-r0/recipe-sysroot-native/lib -L../src /z/jenkins-workspace/nightly/cubietruck/build/tmp-glibc/work/x86_64-linux/libcap-ng-native/0.7.10-r0/build/src/.libs/libcap-ng.so
        22:47:40 | /usr/lib64/gcc/x86_64-suse-linux/8/../../../../x86_64-suse-linux/bin/ld: /z/jenkins-workspace/nightly/cubietruck/build/tmp-glibc/work/x86_64-linux/libcap-ng-native/0.7.10-r0/build/src/.libs/libcap-ng.so: undefined reference to `pthread_atfork'
        22:47:40 | collect2: error: ld returned 1 exit status
        22:47:40 | make[2]: *** [Makefile:480: netcap] Error 1
        22:47:40 | make[2]: Leaving directory '/z/jenkins-workspace/nightly/cubietruck/build/tmp-glibc/work/x86_64-linux/libcap-ng-native/0.7.10-r0/build/utils'
        22:47:40 | make[1]: *** [Makefile:445: all-recursive] Error 1
        22:47:40 | make[1]: Leaving directory '/z/jenkins-workspace/nightly/cubietruck/build/tmp-glibc/work/x86_64-linux/libcap-ng-native/0.7.10-r0/build'
        22:47:40 | make: *** [Makefile:377: all] Error 2
        22:47:40 | WARNING: /z/jenkins-workspace/nightly/cubietruck/build/tmp-glibc/work/x86_64-linux/libcap-ng-native/0.7.10-r0/temp/run.do_compile.12127:1 exit 1 from 'exit 1'
        22:47:40 |
        22:47:40 NOTE: recipe libcap-ng-native-0.7.10-r0: task do_compile: Failed
</pre>
</blockquote>
<p>I see it too, when trying to build binutils:</p>
<p><code></code><code>| x86_64-linux-libtool: link: gcc -W -Wall
-Wshadow -Wformat -Wundef -D_GNU_SOURCE
-isystem/ala-lpggp21/tgamblin/yocto/build/tmp-glibc/work/x86_64-linux/libcap-ng-native/0.7.10-r0/re[6/1973]</code><code><br>
</code><code>root-native/usr/include -O2 -pipe
-Wl,--enable-new-dtags -Wl,-rpath-link
-Wl,/ala-lpggp21/tgamblin/yocto/build/tmp-glibc/work/x86_64-linux/libcap-ng-native/0.7.10-r0/recipe-sysroot-native/us</code><code><br>
</code><code>r/lib -Wl,-rpath-link
-Wl,/ala-lpggp21/tgamblin/yocto/build/tmp-glibc/work/x86_64-linux/libcap-ng-native/0.7.10-r0/recipe-sysroot-native/lib
-Wl,-rpath -Wl,/ala-lpggp21/tgamblin/yocto/build/</code><code><br>
</code><code>tmp-glibc/work/x86_64-linux/libcap-ng-native/0.7.10-r0/recipe-sysroot-native/usr/lib
-Wl,-rpath
-Wl,/ala-lpggp21/tgamblin/yocto/build/tmp-glibc/work/x86_64-linux/libcap-ng-native/0.7.10-r0/r</code><code><br>
</code><code>ecipe-sysroot-native/lib -Wl,-O1 -o .libs/netcap
netcap.o proc-llist.o
-L/ala-lpggp21/tgamblin/yocto/build/tmp-glibc/work/x86_64-linux/libcap-ng-native/0.7.10-r0/recipe-sysroot-native/usr/l</code><code><br>
</code><code>ib
-L/ala-lpggp21/tgamblin/yocto/build/tmp-glibc/work/x86_64-linux/libcap-ng-native/0.7.10-r0/recipe-sysroot-native/lib
-L../src
/ala-lpggp21/tgamblin/yocto/build/tmp-glibc/work/x86_64-linux</code><code><br>
</code><code>/libcap-ng-native/0.7.10-r0/build/src/.libs/libcap-ng.so</code><code><br>
</code><code>|
/ala-lpggp21/tgamblin/yocto/build/tmp-glibc/work/x86_64-linux/libcap-ng-native/0.7.10-r0/build/src/.libs/libcap-ng.so:
undefined reference to `pthread_atfork'</code><code><br>
</code><code>| collect2: error: ld returned 1 exit status</code><code><br>
</code><code>| Makefile:483: recipe for target 'pscap' failed</code><code><br>
</code><code>| make[2]: *** [pscap] Error 1</code><code><br>
</code><code>| make[2]: *** Waiting for unfinished jobs....</code><code><br>
</code><code>|
/ala-lpggp21/tgamblin/yocto/build/tmp-glibc/work/x86_64-linux/libcap-ng-native/0.7.10-r0/build/src/.libs/libcap-ng.so:
undefined reference to `pthread_atfork'</code><code><br>
</code><code>| collect2: error: ld returned 1 exit status</code><code><br>
</code><code>| Makefile:471: recipe for target 'captest'
failed</code><code><br>
</code><code>| make[2]: *** [captest] Error 1</code><code><br>
</code><code>|
/ala-lpggp21/tgamblin/yocto/build/tmp-glibc/work/x86_64-linux/libcap-ng-native/0.7.10-r0/build/src/.libs/libcap-ng.so:
undefined reference to `pthread_atfork'</code><code><br>
</code><code>| collect2: error: ld returned 1 exit status</code><code><br>
</code><code>|
/ala-lpggp21/tgamblin/yocto/build/tmp-glibc/work/x86_64-linux/libcap-ng-native/0.7.10-r0/build/src/.libs/libcap-ng.so:
undefined reference to `pthread_atfork'</code><code><br>
</code><code>| collect2: error: ld returned 1 exit status</code><code><br>
</code><code>| Makefile:475: recipe for target 'filecap'
failed</code><code><br>
</code><code>| make[2]: *** [filecap] Error 1</code><code><br>
</code><code>| Makefile:479: recipe for target 'netcap' failed</code><code><br>
</code><code>| make[2]: *** [netcap] Error 1</code><code><br>
</code><code>| make[2]: Leaving directory
'/ala-lpggp21/tgamblin/yocto/build/tmp-glibc/work/x86_64-linux/libcap-ng-native/0.7.10-r0/build/utils'</code><code><br>
</code><code>| Makefile:445: recipe for target 'all-recursive'
failed</code><code><br>
</code><code>| make[1]: *** [all-recursive] Error 1</code><code><br>
</code><code>| make[1]: Leaving directory
'/ala-lpggp21/tgamblin/yocto/build/tmp-glibc/work/x86_64-linux/libcap-ng-native/0.7.10-r0/build'</code><code><br>
</code><code>| Makefile:377: recipe for target 'all' failed</code><code><br>
</code><code>| make: *** [all] Error 2</code><br>
</p>
<br>
<fieldset class="mimeAttachmentHeader"></fieldset>
</blockquote>
<br>
</blockquote>
</body>
</html>