[oe-issues] [Bug 1679] Cross Compile Badness - Prismstumbler
bugzilla-daemon at tinman.treke.net
bugzilla-daemon at tinman.treke.net
Thu Dec 14 13:31:18 UTC 2006
http://bugs.openembedded.org/show_bug.cgi?id=1679
------- Comment #2 from dothedog at comcast.net 2006-12-14 05:31 -------
Marcin,
I updated yesterday and I am still getting this error:
oc60174 at oc60174:/media/usbdisk/oe/build> bitbake gpe-image
NOTE: Using cache in '/media/usbdisk/oe/build/tmp/cache'
NOTE: Handling BitBake files: / (2632/2632) [100 %]
NOTE: Parsing finished. 2597 cached, 0 parsed, 35 skipped, 0 masked.
NOTE: build 200612132019: started
OE Build Configuration:
BB_VERSION = "1.6.2"
OE_REVISION = "format_version "1"
new_manifest [0000000000000000000000000000000000000004]
old_revision [dbbca7324a1b28346726e887551cc2b9c6b8576b]"
TARGET_ARCH = "arm"
TARGET_OS = "linux"
MACHINE = "akita"
DISTRO = "openzaurus"
DISTRO_VERSION = "3.5.4.1"
TARGET_FPU = "soft"
NOTE: preferred version 1.0.7 of altboot not available
NOTE: preferred version 0.4 of libcontactsdb not available
NOTE: preferred version 0.2.0 of gpe-conf not available
NOTE: preferred version 0.09 of libtododb not available
NOTE: preferred version 0.2 of gpe-plucker not available
NOTE: package prismstumbler-0.7.3: started
NOTE: package prismstumbler-0.7.3-r3: task do_fetch: started
NOTE: package prismstumbler-0.7.3-r3: task do_fetch: completed
NOTE: package prismstumbler-0.7.3-r3: task do_compile: started
ERROR: function do_compile failed
ERROR: log data follows
(/media/usbdisk/oe/build/tmp/work/prismstumbler-0.7.3-r3/temp/log.do_compile.23882)
| NOTE: make
| make all-recursive
| make[1]: Entering directory
`/media/usbdisk/oe/build/tmp/work/prismstumbler-0.7.3-r3/prismstumbler-0.7.3'
| Making all in src
| make[2]: Entering directory
`/media/usbdisk/oe/build/tmp/work/prismstumbler-0.7.3-r3/prismstumbler-0.7.3/src'
| Making all in gpsd
| make[3]: Entering directory
`/media/usbdisk/oe/build/tmp/work/prismstumbler-0.7.3-r3/prismstumbler-0.7.3/src/gpsd'
| ccache arm-linux-gcc -I/media/usbdisk/oe/build/tmp/staging/arm-linux/include
-DHAVE_CONFIG_H
-I/media/usbdisk/oe/build/tmp/work/prismstumbler-0.7.3-r3/prismstumbler-0.7.3/include
-D_GNU_SOURCE -I/media/usbdisk/oe/build/tmp/staging/arm-linux/include
-fexpensive-optimizations -fomit-frame-pointer -frename-registers -O2 -c -I.
-I/usr/include -I/usr/include -o gpsd.o gpsd.c
| CROSS COMPILE Badness: /usr/include in INCLUDEPATH: /usr/include
| cc1: internal compiler error: Aborted
| Please submit a full bug report,
| with preprocessed source if appropriate.
| See <URL:http://gcc.gnu.org/bugs.html> for instructions.
| make[3]: *** [gpsd.o] Error 1
| make[3]: Leaving directory
`/media/usbdisk/oe/build/tmp/work/prismstumbler-0.7.3-r3/prismstumbler-0.7.3/src/gpsd'
| make[2]: *** [all-recursive] Error 1
| make[2]: Leaving directory
`/media/usbdisk/oe/build/tmp/work/prismstumbler-0.7.3-r3/prismstumbler-0.7.3/src'
| make[1]: *** [all-recursive] Error 1
| make[1]: Leaving directory
`/media/usbdisk/oe/build/tmp/work/prismstumbler-0.7.3-r3/prismstumbler-0.7.3'
| make: *** [all] Error 2
| FATAL: oe_runmake failed
--
Configure bugmail: http://bugs.openembedded.org/userprefs.cgi?tab=email
------- You are receiving this mail because: -------
You are the assignee for the bug, or are watching the assignee.
More information about the Openembedded-issues
mailing list