[oe-issues] [Bug 1533] util-linux 2.12r compile error

bugzilla-daemon at tinman.treke.net bugzilla-daemon at tinman.treke.net
Wed Nov 15 14:35:37 UTC 2006


http://bugs.openembedded.org/show_bug.cgi?id=1533


gerwin at vanderkruis.be changed:

           What    |Removed                     |Added
----------------------------------------------------------------------------
                 CC|                            |gerwin at vanderkruis.be




------- Comment #4 from gerwin at vanderkruis.be  2006-11-15 06:35 -------
(In reply to comment #3)
> I used linux-libc-headers-2.6.18, glibc 2.5 and 2.4, gcc 4.1.1.

I came a bit further with one with a patch now I am stuck here :

| cfdisk.c: In function âprint_raw_tableâ:
| cfdisk.c:1999: warning: pointer targets in passing argument 1 of
âread_sectorâ differ in signedness
| cfdisk.c:2001: warning: pointer targets in passing argument 2 of
âprint_file_bufferâ differ in signedness
| cfdisk.c:2006: warning: pointer targets in passing argument 1 of
âread_sectorâ differ in signedness
| cfdisk.c:2008: warning: pointer targets in passing argument 2 of
âprint_file_bufferâ differ in signedness
| ccache i486-linux-gcc  -L/home/gerwinin/build/tmp/staging/i486-linux/lib
-Wl,-rpath-link,/home/gerwinin/build/tmp/staging/i486-linux/lib -Wl,-O1
cfdisk.o llseek.o disksize.o i386_sys_types.o ../lib/xstrncpy.o -o cfdisk
-lncurses
| make[1]: Leaving directory
`/home/gerwinin/build/tmp/work/i486-linux/util-linux-2.12r-r8/util-linux-2.12r/fdisk'
| make[1]: Entering directory
`/home/gerwinin/build/tmp/work/i486-linux/util-linux-2.12r-r8/util-linux-2.12r/hwclock'
| ccache i486-linux-gcc  -c
-isystem/home/gerwinin/build/tmp/staging/i486-linux/include
-fexpensive-optimizations -fomit-frame-pointer -frename-registers -O2 -I../lib
-Wall -Wmissing-prototypes -Wstrict-prototypes -DNCH=1   -D_FILE_OFFSET_BITS=64
-DSBINDIR=\"/sbin\" -DUSRSBINDIR=\"/usr/sbin\" -DLOGDIR=\"/var/log\"
-DVARPATH=\"/var\" -DLOCALEDIR=\"/usr/share/locale\"  hwclock.c -o hwclock.o
| hwclock.c: In function âmainâ:
| hwclock.c:1287: warning: âset_timeâ may be used uninitialized in this
function
| ccache i486-linux-gcc 
-isystem/home/gerwinin/build/tmp/staging/i486-linux/include
-fexpensive-optimizations -fomit-frame-pointer -frename-registers -O2 -I../lib
-Wall  -Wstrict-prototypes -DNCH=1   -D_FILE_OFFSET_BITS=64 -DSBINDIR=\"/sbin\"
-DUSRSBINDIR=\"/usr/sbin\" -DLOGDIR=\"/var/log\" -DVARPATH=\"/var\"
-DLOCALEDIR=\"/usr/share/locale\"  -c cmos.c -o cmos.o
| cmos.c:57:41: error: asm/io.h: No such file or directory
| cmos.c: In function âcmos_readâ:
| cmos.c:315: warning: implicit declaration of function âoutbâ
| cmos.c:316: warning: implicit declaration of function âinbâ
| make[1]: *** [cmos.o] Error 1
| make[1]: Leaving directory
`/home/gerwinin/build/tmp/work/i486-linux/util-linux-2.12r-r8/util-linux-2.12r/hwclock'
| make: *** [all] Error 1
| FATAL: oe_runmake failed
NOTE: Task failed:
/home/gerwinin/build/tmp/work/i486-linux/util-linux-2.12r-r8/temp/log.do_compile.6212
NOTE: package util-linux-2.12r-r8: task do_compile: failed
ERROR: TaskFailed event exception, aborting
NOTE: package util-linux-2.12r: failed


-- 
Configure bugmail: http://bugs.openembedded.org/userprefs.cgi?tab=email
------- You are receiving this mail because: -------
You are the assignee for the bug, or are watching the assignee.




More information about the Openembedded-issues mailing list