[oe-issues] [Bug 1602] New: Libsdl-qpe fails on ld

bugzilla-daemon at tinman.treke.net bugzilla-daemon at tinman.treke.net
Sun Nov 19 13:12:28 UTC 2006


http://bugs.openembedded.org/show_bug.cgi?id=1602

           Summary: Libsdl-qpe fails on ld
           Product: Openembedded
           Version: unspecified
          Platform: PC
        OS/Version: Linux
            Status: NEW
          Severity: normal
          Priority: P2
         Component: Build
        AssignedTo: openembedded-issues at lists.openembedded.org
        ReportedBy: gerwin at vanderkruis.be
         QAContact: tinderbox-oe at gmx.net


|
main/.libs/libarch.a(tinfo2.o):/home/gerwinin/build/tmp/work/x86_64-linux/gcc-cross-4.1.1-r7/gcc-4.1.1/libstdc++-v3/libsupc++/tinfo2.cc:61:
first defined here
| video/.libs/libvideo.a(tinfo2.o): In function `~__fundamental_type_info':
|
/home/gerwinin/build/tmp/work/x86_64-linux/gcc-cross-4.1.1-r7/gcc-4.1.1/libstdc++-v3/libsupc++/tinfo2.cc:61:
multiple definition of
`__cxxabiv1::__fundamental_type_info::~__fundamental_type_info()'
|
main/.libs/libarch.a(tinfo2.o):/home/gerwinin/build/tmp/work/x86_64-linux/gcc-cross-4.1.1-r7/gcc-4.1.1/libstdc++-v3/libsupc++/tinfo2.cc:61:
first defined here
| video/.libs/libvideo.a(tinfo2.o): In function
`__cxxabiv1::__pbase_type_info::__do_catch(std::type_info const*, void**,
unsigned int) const':
|
/home/gerwinin/build/tmp/work/x86_64-linux/gcc-cross-4.1.1-r7/gcc-4.1.1/libstdc++-v3/libsupc++/tinfo2.cc:103:
multiple definition of
`__cxxabiv1::__pbase_type_info::__do_catch(std::type_info const*, void**,
unsigned int) const'
|
main/.libs/libarch.a(tinfo2.o):/home/gerwinin/build/tmp/work/x86_64-linux/gcc-cross-4.1.1-r7/gcc-4.1.1/libstdc++-v3/libsupc++/tinfo2.cc:103:
first defined here
| video/.libs/libvideo.a(tinfo2.o): In function
`__cxxabiv1::__pointer_to_member_type_info::__pointer_catch(__cxxabiv1::__pbase_type_info
const*, void**, unsigned int) const':
|
/home/gerwinin/build/tmp/work/x86_64-linux/gcc-cross-4.1.1-r7/gcc-4.1.1/libstdc++-v3/libsupc++/tinfo2.cc:154:
multiple definition of
`__cxxabiv1::__pointer_to_member_type_info::__pointer_catch(__cxxabiv1::__pbase_type_info
const*, void**, unsigned int) const'
|
main/.libs/libarch.a(tinfo2.o):/home/gerwinin/build/tmp/work/x86_64-linux/gcc-cross-4.1.1-r7/gcc-4.1.1/libstdc++-v3/libsupc++/tinfo2.cc:154:
first defined here
| video/.libs/libvideo.a(del_opnt.o): In function `operator delete(void*,
std::nothrow_t const&)':
|
/home/gerwinin/build/tmp/work/x86_64-linux/gcc-cross-4.1.1-r7/gcc-4.1.1/libstdc++-v3/libsupc++/del_opnt.cc:37:
multiple definition of `operator delete(void*, std::nothrow_t const&)'
|
main/.libs/libarch.a(del_opnt.o):/home/gerwinin/build/tmp/work/x86_64-linux/gcc-cross-4.1.1-r7/gcc-4.1.1/libstdc++-v3/libsupc++/del_opnt.cc:37:
first defined here
| video/.libs/libvideo.a(eh_throw.o): In function `__cxa_rethrow':
|
/home/gerwinin/build/tmp/work/x86_64-linux/gcc-cross-4.1.1-r7/gcc-4.1.1/libstdc++-v3/libsupc++/eh_throw.cc:81:
multiple definition of `__cxa_rethrow'
|
main/.libs/libarch.a(eh_throw.o):/home/gerwinin/build/tmp/work/x86_64-linux/gcc-cross-4.1.1-r7/gcc-4.1.1/libstdc++-v3/libsupc++/eh_throw.cc:81:
first defined here
| video/.libs/libvideo.a(eh_throw.o): In function `__cxa_throw':
|
/home/gerwinin/build/tmp/work/x86_64-linux/gcc-cross-4.1.1-r7/gcc-4.1.1/libstdc++-v3/libsupc++/eh_throw.cc:59:
multiple definition of `__cxa_throw'
|
main/.libs/libarch.a(eh_throw.o):/home/gerwinin/build/tmp/work/x86_64-linux/gcc-cross-4.1.1-r7/gcc-4.1.1/libstdc++-v3/libsupc++/eh_throw.cc:59:
first defined here
| video/.libs/libvideo.a(eh_call.o): In function `__cxa_call_terminate':
|
/home/gerwinin/build/tmp/work/x86_64-linux/gcc-cross-4.1.1-r7/gcc-4.1.1/libstdc++-v3/libsupc++/eh_call.cc:45:
multiple definition of `__cxa_call_terminate'
|
main/.libs/libarch.a(eh_call.o):/home/gerwinin/build/tmp/work/x86_64-linux/gcc-cross-4.1.1-r7/gcc-4.1.1/libstdc++-v3/libsupc++/eh_call.cc:45:
first defined here
|
/home/gerwinin/build/tmp/cross/lib/gcc/i486-linux/4.1.1/../../../../i486-linux/bin/ld:
cannot find -lqte-mt-mt-mt
| collect2: ld returned 1 exit status
| make[2]: *** [libSDL.la] Error 1
| make[2]: Leaving directory
`/home/gerwinin/build/tmp/work/i486-linux/libsdl-qpe-1.2.7-r9/SDL-1.2.7/src'
| make[1]: *** [all-recursive] Error 1
| make[1]: Leaving directory
`/home/gerwinin/build/tmp/work/i486-linux/libsdl-qpe-1.2.7-r9/SDL-1.2.7/src'
| make: *** [all-recursive] Error 1
| FATAL: oe_runmake failed
NOTE: Task failed:
/home/gerwinin/build/tmp/work/i486-linux/libsdl-qpe-1.2.7-r9/temp/log.do_compile.6913
NOTE: package libsdl-qpe-1.2.7-r9: task do_compile: failed
ERROR: TaskFailed event exception, aborting
NOTE: package libsdl-qpe-1.2.7: failed
ERROR: Build of gpe-image failed
gerwinin at holographicklopdoctor:~/build>


-- 
Configure bugmail: http://bugs.openembedded.org/userprefs.cgi?tab=email
------- You are receiving this mail because: -------
You are the assignee for the bug, or are watching the assignee.




More information about the Openembedded-issues mailing list