[oe-issues] [Bug 1623] New: epsilon 0.3.0.007 does not build
bugzilla-daemon at tinman.treke.net
bugzilla-daemon at tinman.treke.net
Tue Nov 28 16:51:02 UTC 2006
http://bugs.openembedded.org/show_bug.cgi?id=1623
Summary: epsilon 0.3.0.007 does not build
Product: Openembedded
Version: unspecified
Platform: Other
OS/Version: Linux
Status: NEW
Severity: normal
Priority: P2
Component: Build
AssignedTo: openembedded-issues at lists.openembedded.org
ReportedBy: openembedded at hrw.one.pl
QAContact: tinderbox-oe at gmx.net
CC: papercrane at reversefold.com
| make[4]: Entering directory
`/a/home/hrw/devel/build/test/tmp/work/epsilon-0.3.0.007-r0/epsilon-0.3.0.007/src/lib'
| if /bin/sh ../../arm-linux-libtool --tag=CC --mode=compile arm-linux-gcc
-march=armv5te -mtune=arm926ejs -DHAVE_CONFIG_H -I.
-I/a/home/hrw/devel/build/te
st/tmp/work/epsilon-0.3.0.007-r0/epsilon-0.3.0.007/src/lib -I../../src
-I/a/home/hrw/devel/build/test/tmp/staging/arm-linux/include/libpng12
-I/a/home/hrw/
devel/build/test/tmp/work/epsilon-0.3.0.007-r0/epsilon-0.3.0.007/src/include
-DPACKAGE_BIN_DIR=\""/usr/bin"\" -isystem/a/home/hrw/devel/build/test/tmp/sta
ging/arm-linux/include
-isystem/a/home/hrw/devel/build/test/tmp/staging/arm-linux/include
-fexpensive-optimizations -fomit-frame-pointer -frename-register
s -O2 -Wall -MT epsilon_thumb_common.lo -MD -MP -MF
".deps/epsilon_thumb_common.Tpo" -c -o epsilon_thumb_common.lo `test -f
'/a/home/hrw/devel/build/test/
tmp/work/epsilon-0.3.0.007-r0/epsilon-0.3.0.007/src/common/epsilon_thumb_common.c'
|| echo '/a/home/hrw/devel/build/test/tmp/work/epsilon-0.3.0.007-r0/epsi
lon-0.3.0.007/src/lib/'`/a/home/hrw/devel/build/test/tmp/work/epsilon-0.3.0.007-r0/epsilon-0.3.0.007/src/common/epsilon_thumb_common.c;
\
| then mv -f ".deps/epsilon_thumb_common.Tpo" ".deps/epsilon_thumb_common.Plo";
else rm -f ".deps/epsilon_thumb_common.Tpo"; exit 1; fi
| arm-linux-gcc -march=armv5te -mtune=arm926ejs -DHAVE_CONFIG_H -I.
-I/a/home/hrw/devel/build/test/tmp/work/epsilon-0.3.0.007-r0/epsilon-0.3.0.007/src/lib
-I../../src
-I/a/home/hrw/devel/build/test/tmp/staging/arm-linux/include/libpng12
-I/a/home/hrw/devel/build/test/tmp/work/epsilon-0.3.0.007-r0/epsilon-0.3
.0.007/src/include -DPACKAGE_BIN_DIR=\"/usr/bin\"
-isystem/a/home/hrw/devel/build/test/tmp/staging/arm-linux/include
-isystem/a/home/hrw/devel/build/test/t
mp/staging/arm-linux/include -fexpensive-optimizations -fomit-frame-pointer
-frename-registers -O2 -Wall -MT epsilon_thumb_common.lo -MD -MP -MF .deps/epsi
lon_thumb_common.Tpo -c
/a/home/hrw/devel/build/test/tmp/work/epsilon-0.3.0.007-r0/epsilon-0.3.0.007/src/common/epsilon_thumb_common.c
-fPIC -DPIC -o .lib
s/epsilon_thumb_common.o
|
/a/home/hrw/devel/build/test/tmp/work/epsilon-0.3.0.007-r0/epsilon-0.3.0.007/src/common/epsilon_thumb_common.c:56:
error: conflicting types for 'epsilon_
ipc_server_send'
|
/a/home/hrw/devel/build/test/tmp/work/epsilon-0.3.0.007-r0/epsilon-0.3.0.007/src/include/epsilon_private.h:44:
error: previous declaration of 'epsilon_ip
c_server_send' was here
|
/a/home/hrw/devel/build/test/tmp/work/epsilon-0.3.0.007-r0/epsilon-0.3.0.007/src/common/epsilon_thumb_common.c:56:
error: conflicting types for 'epsilon_
ipc_server_send'
|
/a/home/hrw/devel/build/test/tmp/work/epsilon-0.3.0.007-r0/epsilon-0.3.0.007/src/include/epsilon_private.h:44:
error: previous declaration of 'epsilon_ip
c_server_send' was here
| make[4]: *** [epsilon_thumb_common.lo] Error 1
| make[4]: Leaving directory
`/a/home/hrw/devel/build/test/tmp/work/epsilon-0.3.0.007-r0/epsilon-0.3.0.007/src/lib'
| make[3]: *** [all-recursive] Error 1
| make[3]: Leaving directory
`/a/home/hrw/devel/build/test/tmp/work/epsilon-0.3.0.007-r0/epsilon-0.3.0.007/src/lib'
| make[2]: *** [all-recursive] Error 1
| make[2]: Leaving directory
`/a/home/hrw/devel/build/test/tmp/work/epsilon-0.3.0.007-r0/epsilon-0.3.0.007/src'
| make[1]: *** [all] Error 2
| make[1]: Leaving directory
`/a/home/hrw/devel/build/test/tmp/work/epsilon-0.3.0.007-r0/epsilon-0.3.0.007/src'
| make: *** [all-recursive] Error 1
| FATAL: oe_runmake failed
NOTE: Task failed:
/a/home/hrw/devel/build/test/tmp/work/epsilon-0.3.0.007-r0/temp/log.do_compile.22096
NOTE: package epsilon-0.3.0.007-r0: task do_compile: failed
--
Configure bugmail: http://bugs.openembedded.org/userprefs.cgi?tab=email
------- You are receiving this mail because: -------
You are the assignee for the bug, or are watching the assignee.
More information about the Openembedded-issues
mailing list