[oe-issues] [Bug 1533] New: util-linux 2.12r compile error

bugzilla-daemon at tinman.treke.net bugzilla-daemon at tinman.treke.net
Fri Oct 27 05:35:06 UTC 2006


http://bugs.openembedded.org/show_bug.cgi?id=1533

           Summary: util-linux 2.12r compile error
           Product: Openembedded
           Version: unspecified
          Platform: Other
        OS/Version: Linux
            Status: NEW
          Severity: normal
          Priority: P2
         Component: Build
        AssignedTo: openembedded-issues at lists.openembedded.org
        ReportedBy: michael.illing at tietoenator.com
         QAContact: tinderbox-oe at gmx.net


The error heppend buildung a 'generic' distro:

--------------------------------------------------------

[snip]
 make[1]: Betrete Verzeichnis
'/data/test/oetmp/work/i486-linux/util-linux-2.12r-r8/util-linux-2.12r/fdisk'
| ccache i486-linux-gcc  -c -isystem/data/test/oetmp/staging/i486-linux/include
-fexpensive-optimizations -fomit-frame-pointer -frename-registers -O2 -I../lib
-Wall -Wmissing-prototypes -Wstrict-prototypes -DNCH=1   -D_FILE_OFFSET_BITS=64
-DSBINDIR=\"/sbin\" -DUSRSBINDIR=\"/usr/sbin\" -DLOGDIR=\"/var/log\"
-DVARPATH=\"/var\" -DLOCALEDIR=\"/usr/share/locale\"  fdisk.c -o fdisk.o
| ccache i486-linux-gcc  -c -isystem/data/test/oetmp/staging/i486-linux/include
-fexpensive-optimizations -fomit-frame-pointer -frename-registers -O2 -I../lib
-Wall -Wmissing-prototypes -Wstrict-prototypes -DNCH=1   -D_FILE_OFFSET_BITS=64
-DSBINDIR=\"/sbin\" -DUSRSBINDIR=\"/usr/sbin\" -DLOGDIR=\"/var/log\"
-DVARPATH=\"/var\" -DLOCALEDIR=\"/usr/share/locale\"  llseek.c -o llseek.o
| ccache i486-linux-gcc  -c -isystem/data/test/oetmp/staging/i486-linux/include
-fexpensive-optimizations -fomit-frame-pointer -frename-registers -O2 -I../lib
-Wall -Wmissing-prototypes -Wstrict-prototypes -DNCH=1   -D_FILE_OFFSET_BITS=64
-DSBINDIR=\"/sbin\" -DUSRSBINDIR=\"/usr/sbin\" -DLOGDIR=\"/var/log\"
-DVARPATH=\"/var\" -DLOCALEDIR=\"/usr/share/locale\"  disksize.c -o disksize.o
| ccache i486-linux-gcc  -c -isystem/data/test/oetmp/staging/i486-linux/include
-fexpensive-optimizations -fomit-frame-pointer -frename-registers -O2 -I../lib
-Wall -Wmissing-prototypes -Wstrict-prototypes -DNCH=1   -D_FILE_OFFSET_BITS=64
-DSBINDIR=\"/sbin\" -DUSRSBINDIR=\"/usr/sbin\" -DLOGDIR=\"/var/log\"
-DVARPATH=\"/var\" -DLOCALEDIR=\"/usr/share/locale\"  fdiskbsdlabel.c -o
fdiskbsdlabel.o
| llseek.c:34: error: expected declaration specifiers or ‘...’ before
‘_llseek’
| llseek.c:34: error: expected declaration specifiers or ‘...’ before
‘fd’
| llseek.c:34: error: expected declaration specifiers or ‘...’ before
‘offset_high’
| llseek.c:35: error: expected declaration specifiers or ‘...’ before
‘offset_low’
| llseek.c:35: error: expected declaration specifiers or ‘...’ before
‘result’
| llseek.c:36: error: expected declaration specifiers or ‘...’ before
‘origin’
| llseek.c:50: warning: return type defaults to ‘int’
| llseek.c: In function ‘_syscall5’:
| llseek.c:52: error: expected ‘=’, ‘,’, ‘;’, ‘asm’ or
‘__attribute__’ before ‘{’ token
| llseek.c:68: error: expected ‘=’, ‘,’, ‘;’, ‘asm’ or
‘__attribute__’ before ‘{’ token
| llseek.c:34: error: parameter name omitted
| llseek.c:34: error: parameter name omitted
| llseek.c:34: error: parameter name omitted
| llseek.c:35: error: parameter name omitted
| llseek.c:35: error: parameter name omitted
| llseek.c:36: error: parameter name omitted
| llseek.c:93: error: expected ‘{’ at end of input
| make[1]: *** [llseek.o] Fehler 1
| make[1]: *** Warte auf noch nicht beendete Prozesse...
| In file included from fdiskbsdlabel.c:60:
| fdisk.h:85: warning: type qualifiers ignored on function return type
| In file included from fdisk.c:25:
| fdisk.h:85: warning: type qualifiers ignored on function return type
| fdisk.c: In function ‘get_partition_table_geometry’:
| fdisk.c:810: warning: pointer targets in initialization differ in signedness
| fdisk.c: In function ‘get_boot’:
| fdisk.c:948: warning: pointer targets in passing argument 1 of
‘valid_part_table_flag’ differ in signedness
| fdisk.c:958: warning: pointer targets in passing argument 1 of
‘valid_part_table_flag’ differ in signedness
| fdisk.c:1002: warning: pointer targets in passing argument 1 of
‘valid_part_table_flag’ differ in signedness
| fdisk.c: At top level:
| fdisk.c:1256: warning: type qualifiers ignored on function return type
| make[1]: Verlasse Verzeichnis
'/data/test/oetmp/work/i486-linux/util-linux-2.12r-r8/util-linux-2.12r/fdisk'
| make: *** [all] Fehler 1
| FATAL: oe_runmake failed
NOTE: Task failed:
/data/test/oetmp/work/i486-linux/util-linux-2.12r-r8/temp/log.do_compile.29394
NOTE: package util-linux-2.12r-r8: task do_compile: failed
ERROR: TaskFailed event exception, aborting
NOTE: package util-linux-2.12r: failed
ERROR: Build of bootstrap-image failed


-- 
Configure bugmail: http://bugs.openembedded.org/userprefs.cgi?tab=email
------- You are receiving this mail because: -------
You are the assignee for the bug, or are watching the assignee.




More information about the Openembedded-issues mailing list