[oe-issues] [Bug 3210] New: minimo_cvs fails to build; cannot access nsBuildID.h

bugzilla-daemon at tinman.treke.net bugzilla-daemon at tinman.treke.net
Thu Oct 25 06:15:57 UTC 2007


http://bugs.openembedded.org/show_bug.cgi?id=3210

           Summary: minimo_cvs fails to build; cannot access nsBuildID.h
           Product: Openembedded
           Version: unspecified
          Platform: ARM
        OS/Version: Linux
            Status: NEW
          Severity: normal
          Priority: P2
         Component: Build
        AssignedTo: openembedded-issues at lists.openembedded.org
        ReportedBy: cm at acc.umu.se


NOTE: build 200710250808: started

OE Build Configuration:
BB_VERSION     = "1.8.8"
OE_REVISION    = "b9c86a3872216cb5215d6084b53f43043ce9d29e"
TARGET_ARCH    = "arm"
TARGET_OS      = "linux-gnueabi"
MACHINE        = "fic-gta01"
DISTRO         = "openmoko"
DISTRO_VERSION = "P1-Snapshot-20071025"
TARGET_FPU     = "soft"

NOTE: Resolving missing task queue dependencies
NOTE: preferred version 2.5 of glibc not available (for item
virtual/arm-angstrom-linux-gnueabi-libc-for-gcc)
NOTE: Preparing runqueue
NOTE: Executing runqueue
NOTE: Running task 1125 of 1149 (ID: 7,
/home/moko/openembedded/packages/mozilla/minimo_cvs.bb, do_compile)
NOTE: package minimo-0.02+cvs20070626: started
NOTE: package minimo-1_0.02+cvs20070626-r0: task do_compile: started
ERROR: function do_compile failed
ERROR: log data follows
(/home/moko/build/tmp/work/armv4t-angstrom-linux-gnueabi/minimo-1_0.02+cvs20070626-r0/temp/log.do_compile.5810)
| NOTE: make -f client.mk build
| make
| make[1]: Entering directory
`/home/moko/build/tmp/work/armv4t-angstrom-linux-gnueabi/minimo-1_0.02+cvs20070626-r0/mozilla'
| rm -f -rf ./dist/sdk
| rm -f -rf ./dist/include
| /usr/bin/make -C config export
| make[2]: Entering directory
`/home/moko/build/tmp/work/armv4t-angstrom-linux-gnueabi/minimo-1_0.02+cvs20070626-r0/mozilla/config'
| /home/moko/build/tmp/staging/x86_64-linux/bin/perl -I. ./bdate.pl
build_number
|
/home/moko/build/tmp/work/armv4t-angstrom-linux-gnueabi/minimo-1_0.02+cvs20070626-r0/mozilla/config/nsinstall
-R -m 644 nsBuildID.h ../mozilla-config.h ./nsStaticComponents.h 
../dist/include
| rm -f ../config/final-link-comps ../config/final-link-libs
../config/final-link-comp-names
| rm -f ../dist/bin/chrome/chromelist.txt
|
/home/moko/build/tmp/work/armv4t-angstrom-linux-gnueabi/minimo-1_0.02+cvs20070626-r0/mozilla/config/nsinstall
-t -m 644 nsBuildID.h ../mozilla-config.h ./nsStaticComponents.h 
../dist/sdk/include
|
/home/moko/build/tmp/work/armv4t-angstrom-linux-gnueabi/minimo-1_0.02+cvs20070626-r0/mozilla/config/nsinstall:
cannot access nsBuildID.h: Invalid argument
| make[2]: *** [export] Error 1
| make[2]: Leaving directory
`/home/moko/build/tmp/work/armv4t-angstrom-linux-gnueabi/minimo-1_0.02+cvs20070626-r0/mozilla/config'
| make[1]: *** [default] Error 2
| make[1]: Leaving directory
`/home/moko/build/tmp/work/armv4t-angstrom-linux-gnueabi/minimo-1_0.02+cvs20070626-r0/mozilla'
| make: *** [build] Error 2
| FATAL: oe_runmake failed
NOTE: Task failed:
/home/moko/build/tmp/work/armv4t-angstrom-linux-gnueabi/minimo-1_0.02+cvs20070626-r0/temp/log.do_compile.5810
NOTE: package minimo-1_0.02+cvs20070626-r0: task do_compile: failed
ERROR: TaskFailed event exception, aborting
NOTE: package minimo-0.02+cvs20070626: failed
ERROR: Build of /home/moko/openembedded/packages/mozilla/minimo_cvs.bb
do_compile failed
ERROR: Task 7 (/home/moko/openembedded/packages/mozilla/minimo_cvs.bb,
do_compile) failed
NOTE: Tasks Summary: Attempted 1124 tasks of which 1124 didn't need to be rerun
and 1 failed.
ERROR: '/home/moko/openembedded/packages/mozilla/minimo_cvs.bb' failed


(Yes, I know webkit actually compiles now, but some people seem to want XUL..
;)


-- 
Configure bugmail: http://bugs.openembedded.org/userprefs.cgi?tab=email
------- You are receiving this mail because: -------
You are the assignee for the bug.




More information about the Openembedded-issues mailing list