[oe-issues] [Bug 2927] New: directfb-0.9.25.1-r1 on OE 1.4 for Dreambox fails
bugzilla-daemon at tinman.treke.net
bugzilla-daemon at tinman.treke.net
Wed Sep 5 12:59:11 UTC 2007
http://bugs.openembedded.org/show_bug.cgi?id=2927
Summary: directfb-0.9.25.1-r1 on OE 1.4 for Dreambox fails
Product: Openembedded
Version: unspecified
Platform: MIPS
OS/Version: Linux
Status: NEW
Severity: normal
Priority: P2
Component: Build
AssignedTo: openembedded-issues at lists.openembedded.org
ReportedBy: zengaja at gmx.de
Making all in fbdev
make[3]: Entering directory
`/data/Openembedded/build/tmp/work/directfb-0.9.25.1-r1/DirectFB-0.9.25.1/systems/fbdev'
if /bin/sh ../../mipsel-linux-libtool --tag=CC --mode=compile mipsel-linux-gcc
-DHAVE_CONFIG_H -I.
-I/data/Openembedded/build/tmp/work/directfb-0.9.25.1-r1/DirectFB-0.9.25.1/systems/fbdev
-I../..
-I/data/Openembedded/build/tmp/work/directfb-0.9.25.1-r1/DirectFB-0.9.25.1/include
-I../../include -I../../lib
-I/data/Openembedded/build/tmp/work/directfb-0.9.25.1-r1/DirectFB-0.9.25.1/lib
-I/data/Openembedded/build/tmp/work/directfb-0.9.25.1-r1/DirectFB-0.9.25.1/src
-D_XOPEN_SOURCE=500 -D_REENTRANT
-I/data/Openembedded/build/tmp/staging/mipsel-linux/include -O3 -ffast-math
-pipe -I/data/Openembedded/build/tmp/staging/mipsel-linux/include
-fexpensive-optimizations -fomit-frame-pointer -frename-registers -O2
-D_GNU_SOURCE -Werror-implicit-function-declaration -MT fbdev.lo -MD -MP -MF
".deps/fbdev.Tpo" -c -o fbdev.lo fbdev.c; \
then mv -f ".deps/fbdev.Tpo" ".deps/fbdev.Plo"; else rm -f
".deps/fbdev.Tpo"; exit 1; fi
mipsel-linux-gcc -DHAVE_CONFIG_H -I.
-I/data/Openembedded/build/tmp/work/directfb-0.9.25.1-r1/DirectFB-0.9.25.1/systems/fbdev
-I../..
-I/data/Openembedded/build/tmp/work/directfb-0.9.25.1-r1/DirectFB-0.9.25.1/include
-I../../include -I../../lib
-I/data/Openembedded/build/tmp/work/directfb-0.9.25.1-r1/DirectFB-0.9.25.1/lib
-I/data/Openembedded/build/tmp/work/directfb-0.9.25.1-r1/DirectFB-0.9.25.1/src
-D_XOPEN_SOURCE=500 -D_REENTRANT
-I/data/Openembedded/build/tmp/staging/mipsel-linux/include -O3 -ffast-math
-pipe -I/data/Openembedded/build/tmp/staging/mipsel-linux/include
-fexpensive-optimizations -fomit-frame-pointer -frename-registers -O2
-D_GNU_SOURCE -Werror-implicit-function-declaration -MT fbdev.lo -MD -MP -MF
.deps/fbdev.Tpo -c fbdev.c -fPIC -DPIC -o .libs/fbdev.o
In file included from
/data/Openembedded/build/tmp/staging/mipsel-linux/include/linux/types.h:6,
from
/data/Openembedded/build/tmp/staging/mipsel-linux/include/linux/agpgart.h:52,
from agp.h:32,
from fbdev.h:40,
from fbdev.c:84:
/data/Openembedded/build/tmp/staging/mipsel-linux/include/asm/types.h:22:
error: redefinition of typedef 'int8_t'
/data/Openembedded/build/tmp/staging/mipsel-linux/include/sys/types.h:191:
error: previous declaration of 'int8_t' was here
/data/Openembedded/build/tmp/staging/mipsel-linux/include/asm/types.h:23:
error: redefinition of typedef 'u_int8_t'
/data/Openembedded/build/tmp/staging/mipsel-linux/include/sys/types.h:197:
error: previous declaration of 'u_int8_t' was here
/data/Openembedded/build/tmp/staging/mipsel-linux/include/asm/types.h:25:
error: redefinition of typedef 'int16_t'
/data/Openembedded/build/tmp/staging/mipsel-linux/include/sys/types.h:192:
error: previous declaration of 'int16_t' was here
/data/Openembedded/build/tmp/staging/mipsel-linux/include/asm/types.h:26:
error: redefinition of typedef 'u_int16_t'
/data/Openembedded/build/tmp/staging/mipsel-linux/include/sys/types.h:198:
error: previous declaration of 'u_int16_t' was here
/data/Openembedded/build/tmp/staging/mipsel-linux/include/asm/types.h:28:
error: redefinition of typedef 'int32_t'
/data/Openembedded/build/tmp/staging/mipsel-linux/include/sys/types.h:193:
error: previous declaration of 'int32_t' was here
/data/Openembedded/build/tmp/staging/mipsel-linux/include/asm/types.h:29:
error: redefinition of typedef 'u_int32_t'
/data/Openembedded/build/tmp/staging/mipsel-linux/include/sys/types.h:199:
error: previous declaration of 'u_int32_t' was here
/data/Openembedded/build/tmp/staging/mipsel-linux/include/asm/types.h:42:
error: redefinition of typedef 'int64_t'
/data/Openembedded/build/tmp/staging/mipsel-linux/include/sys/types.h:194:
error: previous declaration of 'int64_t' was here
/data/Openembedded/build/tmp/staging/mipsel-linux/include/asm/types.h:43:
error: redefinition of typedef 'u_int64_t'
/data/Openembedded/build/tmp/staging/mipsel-linux/include/sys/types.h:200:
error: previous declaration of 'u_int64_t' was here
make[3]: *** [fbdev.lo] Error 1
make[3]: Leaving directory
`/data/Openembedded/build/tmp/work/directfb-0.9.25.1-r1/DirectFB-0.9.25.1/systems/fbdev'
make[2]: *** [all-recursive] Error 1
make[2]: Leaving directory
`/data/Openembedded/build/tmp/work/directfb-0.9.25.1-r1/DirectFB-0.9.25.1/systems'
make[1]: *** [all-recursive] Error 1
make[1]: Leaving directory
`/data/Openembedded/build/tmp/work/directfb-0.9.25.1-r1/DirectFB-0.9.25.1'
make: *** [all] Error 2
FATAL: oe_runmake failed
--
Configure bugmail: http://bugs.openembedded.org/userprefs.cgi?tab=email
------- You are receiving this mail because: -------
You are the assignee for the bug.
More information about the Openembedded-issues
mailing list