[oe-issues] [Bug 2931] New: libgcc-related SO link errors after recent changes to gcc. bb

bugzilla-daemon at tinman.treke.net bugzilla-daemon at tinman.treke.net
Thu Sep 6 02:01:06 UTC 2007


http://bugs.openembedded.org/show_bug.cgi?id=2931

           Summary: libgcc-related SO link errors after recent changes to
                    gcc.bb
           Product: Openembedded
           Version: Angstrom
          Platform: Other
        OS/Version: Linux
            Status: NEW
          Severity: normal
          Priority: P1
         Component: Build
        AssignedTo: openembedded-issues at lists.openembedded.org
        ReportedBy: pmiscml at gmail.com


$ bitbake gst-plugins-base -c rebuild

OE Build Configuration:
BB_VERSION     = "1.8.9"
OE_REVISION    = "6a2d2b93d5aaaeac208513989dea7830e85864d2"
TARGET_ARCH    = "arm"
TARGET_OS      = "linux-gnueabi"
MACHINE        = "hx4700"
DISTRO         = "angstrom"
DISTRO_VERSION = "2007.9-test-20070906"
TARGET_FPU     = "soft"


| arm-angstrom-linux-gnueabi-gcc -march=armv5te -mtune=xscale
-isystem/home/pfalcon/linux-ppc/build-oe-angstrom/tmp/staging/arm-angstrom-linux-gnueabi/include
-fexpensive-optimizations -fomit-frame-pointer -frename-registers -Os
-Wl,-rpath-link
-Wl,/home/pfalcon/linux-ppc/build-oe-angstrom/tmp/staging/arm-angstrom-linux-gnueabi/lib
-Wl,-O1 -o .libs/testchannels testchannels-testchannels.o 
-L/home/pfalcon/linux-ppc/build-oe-angstrom/tmp/staging/arm-angstrom-linux-gnueabi/lib
-pthread
/home/pfalcon/linux-ppc/build-oe-angstrom/tmp/staging/arm-angstrom-linux-gnueabi/lib/libgstreamer-0.10.so
/home/pfalcon/linux-ppc/build-oe-angstrom/tmp/staging/arm-angstrom-linux-gnueabi/lib/libgobject-2.0.so
/home/pfalcon/linux-ppc/build-oe-angstrom/tmp/staging/arm-angstrom-linux-gnueabi/lib/libgmodule-2.0.so
/home/pfalcon/linux-ppc/build-oe-angstrom/tmp/staging/arm-angstrom-linux-gnueabi/lib/libgthread-2.0.so
-lrt
/home/pfalcon/linux-ppc/build-oe-angstrom/tmp/staging/arm-angstrom-linux-gnueabi/lib/libxml2.so
-ldl -lpthread
/home/pfalcon/linux-ppc/build-oe-angstrom/tmp/staging/arm-angstrom-linux-gnueabi/lib/libz.so
-lm
/home/pfalcon/linux-ppc/build-oe-angstrom/tmp/staging/arm-angstrom-linux-gnueabi/lib/libglib-2.0.so
-Wl,--rpath
-Wl,/home/pfalcon/linux-ppc/build-oe-angstrom/tmp/work/armv5te-angstrom-linux-gnueabi/zlib-1.2.3-r2/image/usr/lib
|
/home/pfalcon/linux-ppc/build-oe-angstrom/tmp/cross/lib/gcc/arm-angstrom-linux-gnueabi/4.1.2/../../../../arm-angstrom-linux-gnueabi/bin/ld:
.libs/testchannels: hidden symbol `__div0' in
/home/pfalcon/linux-ppc/build-oe-angstrom/tmp/cross/lib/gcc/arm-angstrom-linux-gnueabi/4.1.2/libgcc.a(_dvmd_lnx.o)
is referenced by DSO
|
/home/pfalcon/linux-ppc/build-oe-angstrom/tmp/cross/lib/gcc/arm-angstrom-linux-gnueabi/4.1.2/../../../../arm-angstrom-linux-gnueabi/bin/ld:
final link failed: Nonrepresentable section on output
| collect2: ld returned 1 exit status
| make[5]: *** [testchannels] Error 1
| make[5]: Leaving directory
`/home/pfalcon/linux-ppc/build-oe-angstrom/tmp/work/armv5te-angstrom-linux-gnueabi/gst-plugins-base-0.10.14-r2/gst-plugins-base-0.10.14/gst-libs/gst/audio'
| make[4]: *** [all] Error 2
| make[4]: Leaving directory
`/home/pfalcon/linux-ppc/build-oe-angstrom/tmp/work/armv5te-angstrom-linux-gnueabi/gst-plugins-base-0.10.14-r2/gst-plugins-base-0.10.14/gst-libs/gst/audio'
| make[3]: *** [all-recursive] Error 1
| make[3]: Leaving directory
`/home/pfalcon/linux-ppc/build-oe-angstrom/tmp/work/armv5te-angstrom-linux-gnueabi/gst-plugins-base-0.10.14-r2/gst-plugins-base-0.10.14/gst-libs/gst'
| make[2]: *** [all-recursive] Error 1
| make[2]: Leaving directory
`/home/pfalcon/linux-ppc/build-oe-angstrom/tmp/work/armv5te-angstrom-linux-gnueabi/gst-plugins-base-0.10.14-r2/gst-plugins-base-0.10.14/gst-libs'
| make[1]: *** [all-recursive] Error 1
| make[1]: Leaving directory
`/home/pfalcon/linux-ppc/build-oe-angstrom/tmp/work/armv5te-angstrom-linux-gnueabi/gst-plugins-base-0.10.14-r2/gst-plugins-base-0.10.14'
| make: *** [all] Error 2
| FATAL: oe_runmake failed
NOTE: Task failed:
/home/pfalcon/linux-ppc/build-oe-angstrom/tmp/work/armv5te-angstrom-linux-gnueabi/gst-plugins-base-0.10.14-r2/temp/log.do_compile.31591
NOTE: package gst-plugins-base-0.10.14-r2: task do_compile: failed


-- 
Configure bugmail: http://bugs.openembedded.org/userprefs.cgi?tab=email
------- You are receiving this mail because: -------
You are the assignee for the bug.




More information about the Openembedded-issues mailing list