[Bug 4244] New: org.openembedded.stable - gconf-dbus_svn.bb do_compile failed
bugzilla-daemon at amethyst.openembedded.net
bugzilla-daemon at amethyst.openembedded.net
Sat May 10 11:20:01 UTC 2008
http://bugs.openembedded.net/show_bug.cgi?id=4244
Summary: org.openembedded.stable - gconf-dbus_svn.bb do_compile
failed
Classification: Unclassified
Product: Openembedded
Version: unspecified
Platform: PC
OS/Version: Linux
Status: NEW
Severity: normal
Priority: P3
Component: Build
AssignedTo: openembedded-issues at lists.openembedded.org
ReportedBy: javiroman at kernel-labs.org
Build of gconf-dbus_svn.bb failed from generic.conf distro and stable branch.
The log ... gconf-dbus-2.16.0+svnr606-r5/temp/log.do_compile.8800:
gconf-value.c: In function 'gconf_value_new':
gconf-value.c:76: warning: implicit declaration of function 'g_slice_new0'
gconf-value.c:76: error: expected expression before 'GConfRealValue'
gconf-value.c: In function 'gconf_value_free':
gconf-value.c:829: warning: implicit declaration of function 'g_slice_free'
gconf-value.c:829: error: expected expression before 'GConfRealValue'
gconf-value.c: In function 'gconf_entry_new_nocopy':
gconf-value.c:1455: warning: implicit declaration of function 'g_slice_new'
gconf-value.c:1455: error: expected expression before 'GConfRealEntry'
gconf-value.c:1455: warning: assignment makes pointer from integer without a
cast
gconf-value.c: In function 'gconf_entry_unref':
gconf-value.c:1494: error: expected expression before 'GConfRealEntry'
make[3]: *** [gconf-value.lo] Error 1
It is the same bug http://bugs.openembedded.net/show_bug.cgi?id=2978,
nevertheless the solution doesn't work for me.
--
Configure bugmail: http://bugs.openembedded.net/userprefs.cgi?tab=email
------- You are receiving this mail because: -------
You are the assignee for the bug.
More information about the Openembedded-issues
mailing list