[Bug 4263] New: gpe-today build fails
bugzilla-daemon at amethyst.openembedded.net
bugzilla-daemon at amethyst.openembedded.net
Thu May 15 09:05:56 UTC 2008
http://bugs.openembedded.net/show_bug.cgi?id=4263
Summary: gpe-today build fails
Classification: Unclassified
Product: Openembedded
Version: Angstrom 2007.12
Platform: ARM
OS/Version: Linux
Status: UNCONFIRMED
Severity: normal
Priority: P3
Component: org.openembedded.stable
AssignedTo: openembedded-issues at lists.openembedded.org
ReportedBy: jay4mail at gmail.com
I trying to build gpe-today but it fails with following messages.
MTN was updated today (2008-05-15).
DISTRO = "angstrom-2007.1"
MACHINE = "akita"
bitbake gpe-today fails with messages:
| NOTE: make -e MAKEFLAGS= PREFIX=/usr
| arm-angstrom-linux-gnueabi-gcc -march=armv5te -mtune=xscale
-isystem/data/openembedded/tmp/staging/arm-angstrom-linux-gnueabi/include
-fexpensive-optimizations -fomit-frame-pointer -frename-registers -Os
-isystem/data/openembedded/tmp/staging/arm-angstrom-linux-gnueabi/include -Os
-fomit-frame-pointer -MD -Wall
-I/data/openembedded/tmp/staging/arm-angstrom-linux-gnueabi/include
-I/data/openembedded/tmp/staging/arm-angstrom-linux-gnueabi/include/gtk-2.0
-I/data/openembedded/tmp/staging/arm-angstrom-linux-gnueabi/lib/gtk-2.0/include
-I/data/openembedded/tmp/staging/arm-angstrom-linux-gnueabi/include/atk-1.0
-I/data/openembedded/tmp/staging/arm-angstrom-linux-gnueabi/include/cairo
-I/data/openembedded/tmp/staging/arm-angstrom-linux-gnueabi/include/pango-1.0
-I/data/openembedded/tmp/staging/arm-angstrom-linux-gnueabi/include/glib-2.0
-I/data/openembedded/tmp/staging/arm-angstrom-linux-gnueabi/lib/glib-2.0/include
-I/data/openembedded/tmp/staging/arm-angstrom-linux-gnueabi/include/freetype2
-I/data/openembedded/tmp/staging/arm-angstrom-linux-gnueabi/include/libpng12
`pkg-config --cflags libeventdb libtododb libxsettings-client sqlite
libgpepimc` -D_GNU_SOURCE -DPACKAGE=\"gpe-today\" -DPREFIX=\"/usr\"
-DPACKAGE_LOCALE_DIR=\"/usr/share/locale\" -c main.c -o main.o
| arm-angstrom-linux-gnueabi-gcc -march=armv5te -mtune=xscale
-isystem/data/openembedded/tmp/staging/arm-angstrom-linux-gnueabi/include
-fexpensive-optimizations -fomit-frame-pointer -frename-registers -Os
-isystem/data/openembedded/tmp/staging/arm-angstrom-linux-gnueabi/include -Os
-fomit-frame-pointer -MD -Wall
-I/data/openembedded/tmp/staging/arm-angstrom-linux-gnueabi/include
-I/data/openembedded/tmp/staging/arm-angstrom-linux-gnueabi/include/gtk-2.0
-I/data/openembedded/tmp/staging/arm-angstrom-linux-gnueabi/lib/gtk-2.0/include
-I/data/openembedded/tmp/staging/arm-angstrom-linux-gnueabi/include/atk-1.0
-I/data/openembedded/tmp/staging/arm-angstrom-linux-gnueabi/include/cairo
-I/data/openembedded/tmp/staging/arm-angstrom-linux-gnueabi/include/pango-1.0
-I/data/openembedded/tmp/staging/arm-angstrom-linux-gnueabi/include/glib-2.0
-I/data/openembedded/tmp/staging/arm-angstrom-linux-gnueabi/lib/glib-2.0/include
-I/data/openembedded/tmp/staging/arm-angstrom-linux-gnueabi/include/freetype2
-I/data/openembedded/tmp/staging/arm-angstrom-linux-gnueabi/include/libpng12
`pkg-config --cflags libeventdb libtododb libxsettings-client sqlite
libgpepimc` -D_GNU_SOURCE -DPACKAGE=\"gpe-today\" -DPREFIX=\"/usr\"
-DPACKAGE_LOCALE_DIR=\"/usr/share/locale\" -c todo.c -o todo.o
| arm-angstrom-linux-gnueabi-gcc -march=armv5te -mtune=xscale
-isystem/data/openembedded/tmp/staging/arm-angstrom-linux-gnueabi/include
-fexpensive-optimizations -fomit-frame-pointer -frename-registers -Os
-isystem/data/openembedded/tmp/staging/arm-angstrom-linux-gnueabi/include -Os
-fomit-frame-pointer -MD -Wall
-I/data/openembedded/tmp/staging/arm-angstrom-linux-gnueabi/include
-I/data/openembedded/tmp/staging/arm-angstrom-linux-gnueabi/include/gtk-2.0
-I/data/openembedded/tmp/staging/arm-angstrom-linux-gnueabi/lib/gtk-2.0/include
-I/data/openembedded/tmp/staging/arm-angstrom-linux-gnueabi/include/atk-1.0
-I/data/openembedded/tmp/staging/arm-angstrom-linux-gnueabi/include/cairo
-I/data/openembedded/tmp/staging/arm-angstrom-linux-gnueabi/include/pango-1.0
-I/data/openembedded/tmp/staging/arm-angstrom-linux-gnueabi/include/glib-2.0
-I/data/openembedded/tmp/staging/arm-angstrom-linux-gnueabi/lib/glib-2.0/include
-I/data/openembedded/tmp/staging/arm-angstrom-linux-gnueabi/include/freetype2
-I/data/openembedded/tmp/staging/arm-angstrom-linux-gnueabi/include/libpng12
`pkg-config --cflags libeventdb libtododb libxsettings-client sqlite
libgpepimc` -D_GNU_SOURCE -DPACKAGE=\"gpe-today\" -DPREFIX=\"/usr\"
-DPACKAGE_LOCALE_DIR=\"/usr/share/locale\" -c calendar.c -o calendar.o
| calendar.c:30: error: expected specifier-qualifier-list before 'event_t'
| calendar.c:38: error: expected ')' before 'event'
| calendar.c: In function 'refresh_event_markup':
| calendar.c:114: error: 'struct calevent' has no member named 'ev'
| calendar.c:114: error: 'FLAG_UNTIMED' undeclared (first use in this function)
| calendar.c:114: error: (Each undeclared identifier is reported only once
| calendar.c:114: error: for each function it appears in.)
| calendar.c:115: error: 'calendar_time_t' undeclared (first use in this
function)
| calendar.c:115: error: expected ';' before 'end'
| calendar.c:118: error: 'struct calevent' has no member named 'ev'
| calendar.c:120: error: 'end' undeclared (first use in this function)
| calendar.c:129: error: 'struct calevent' has no member named 'in_progress'
| calendar.c:131: error: 'struct calevent' has no member named 'pl'
| calendar.c:132: error: 'struct calevent' has no member named 'summary'
| calendar.c: In function 'calendar_update':
| calendar.c:170: error: 'struct calevent' has no member named 'ev'
| calendar.c:170: error: 'struct calevent' has no member named 'ev'
| calendar.c:180: error: 'struct calevent' has no member named 'ev'
| calendar.c:181: error: 'struct calevent' has no member named 'in_progress'
| calendar.c:184: error: 'struct calevent' has no member named 'in_progress'
| calendar.c: In function 'calendar_events_db_update':
| calendar.c:200: error: 'event_t' undeclared (first use in this function)
| calendar.c:200: error: expected ';' before 'ev'
| calendar.c:203: warning: implicit declaration of function 'event_db_start'
| calendar.c:216: warning: passing argument 1 of
'event_db_untimed_list_for_period' makes pointer from integer without a cast
| calendar.c:216: error: too few arguments to function
'event_db_untimed_list_for_period'
| calendar.c:217: error: 'ev' undeclared (first use in this function)
| calendar.c:217: error: expected ')' before 'g_slist_nth_data'
| calendar.c:218: warning: implicit declaration of function
'calendar_add_event'
| calendar.c:219: warning: implicit declaration of function
'event_db_list_destroy'
| calendar.c:221: warning: passing argument 1 of 'event_db_list_for_period'
makes pointer from integer without a cast
| calendar.c:221: error: too few arguments to function
'event_db_list_for_period'
| calendar.c:222: error: expected ')' before 'g_slist_nth_data'
| calendar.c:231: warning: implicit declaration of function 'event_db_stop'
| calendar.c: At top level:
| calendar.c:234: error: expected ')' before 'event'
| calendar.c: In function 'free_calevent':
| calendar.c:277: error: 'struct calevent' has no member named 'summary'
| calendar.c:278: error: 'struct calevent' has no member named 'description'
| calendar.c:279: error: 'struct calevent' has no member named 'pl'
| calendar.c: In function 'remove_calendar_entry':
| calendar.c:286: error: 'struct calevent' has no member named 'pl'
| make: *** [calendar.o] Error 1
| FATAL: oe_runmake failed
NOTE: Task failed:
/data/openembedded/tmp/work/armv5te-angstrom-linux-gnueabi/gpe-today-0.11-r0/temp/log.do_compile.30768
--
Configure bugmail: http://bugs.openembedded.net/userprefs.cgi?tab=email
------- You are receiving this mail because: -------
You are the assignee for the bug.
More information about the Openembedded-issues
mailing list