[Bug 4267] New: openssl-natve-0.9.7m-r2 does not compile on x86_64
bugzilla-daemon at amethyst.openembedded.net
bugzilla-daemon at amethyst.openembedded.net
Fri May 16 17:59:27 UTC 2008
http://bugs.openembedded.net/show_bug.cgi?id=4267
Summary: openssl-natve-0.9.7m-r2 does not compile on x86_64
Classification: Unclassified
Product: Openembedded
Version: unspecified
Platform: Other
OS/Version: other
Status: UNCONFIRMED
Severity: minor
Priority: P3
Component: org.openembedded.dev
AssignedTo: openembedded-issues at lists.openembedded.org
ReportedBy: cliff.brake at gmail.com
works fine on 32-bit machine, failes on 64-bit host:
NOTE: Running task 171 of 276 (ID: 7,
/build/oe/build/oe/org.openembedded.dev/packages/openssl/openssl-native_0.9.7m.bb,
do_compile)
NOTE: package openssl-native-0.9.7m: started
NOTE: package openssl-native-0.9.7m-r2: task do_compile: started
ERROR: function do_compile failed
ERROR: log data follows
(/build/oe/build/build/angstrom-2008.1/tmp/work/x86_64-linux/openssl-native-0.9.7m-r2/temp/log.do_compile.4915)
| NOTE: make -e MAKEFLAGS=
| making all in crypto...
| make[1]: Entering directory
`/build/oe/build/build/angstrom-2008.1/tmp/work/x86_64-linux/openssl-native-0.9.7m-r2/openssl-0.9.7m/crypto'
| making all in crypto/objects...
| make[2]: Entering directory
`/build/oe/build/build/angstrom-2008.1/tmp/work/x86_64-linux/openssl-native-0.9.7m-r2/openssl-0.9.7m/crypto/objects'
| make[2]: Nothing to be done for `all'.
| make[2]: Leaving directory
`/build/oe/build/build/angstrom-2008.1/tmp/work/x86_64-linux/openssl-native-0.9.7m-r2/openssl-0.9.7m/crypto/objects'
| making all in crypto/md2...
| make[2]: Entering directory
`/build/oe/build/build/angstrom-2008.1/tmp/work/x86_64-linux/openssl-native-0.9.7m-r2/openssl-0.9.7m/crypto/md2'
| make[2]: Nothing to be done for `all'.
| make[2]: Leaving directory
`/build/oe/build/build/angstrom-2008.1/tmp/work/x86_64-linux/openssl-native-0.9.7m-r2/openssl-0.9.7m/crypto/md2'
| making all in crypto/md4...
| make[2]: Entering directory
`/build/oe/build/build/angstrom-2008.1/tmp/work/x86_64-linux/openssl-native-0.9.7m-r2/openssl-0.9.7m/crypto/md4'
| make[2]: Nothing to be done for `all'.
| make[2]: Leaving directory
`/build/oe/build/build/angstrom-2008.1/tmp/work/x86_64-linux/openssl-native-0.9.7m-r2/openssl-0.9.7m/crypto/md4'
| making all in crypto/md5...
| make[2]: Entering directory
`/build/oe/build/build/angstrom-2008.1/tmp/work/x86_64-linux/openssl-native-0.9.7m-r2/openssl-0.9.7m/crypto/md5'
| make[2]: Nothing to be done for `all'.
| make[2]: Leaving directory
`/build/oe/build/build/angstrom-2008.1/tmp/work/x86_64-linux/openssl-native-0.9.7m-r2/openssl-0.9.7m/crypto/md5'
| making all in crypto/sha...
| make[2]: Entering directory
`/build/oe/build/build/angstrom-2008.1/tmp/work/x86_64-linux/openssl-native-0.9.7m-r2/openssl-0.9.7m/crypto/sha'
| make[2]: Nothing to be done for `all'.
| make[2]: Leaving directory
`/build/oe/build/build/angstrom-2008.1/tmp/work/x86_64-linux/openssl-native-0.9.7m-r2/openssl-0.9.7m/crypto/sha'
| making all in crypto/mdc2...
| make[2]: Entering directory
`/build/oe/build/build/angstrom-2008.1/tmp/work/x86_64-linux/openssl-native-0.9.7m-r2/openssl-0.9.7m/crypto/mdc2'
| make[2]: Nothing to be done for `all'.
| make[2]: Leaving directory
`/build/oe/build/build/angstrom-2008.1/tmp/work/x86_64-linux/openssl-native-0.9.7m-r2/openssl-0.9.7m/crypto/mdc2'
| making all in crypto/hmac...
| make[2]: Entering directory
`/build/oe/build/build/angstrom-2008.1/tmp/work/x86_64-linux/openssl-native-0.9.7m-r2/openssl-0.9.7m/crypto/hmac'
| make[2]: Nothing to be done for `all'.
| make[2]: Leaving directory
`/build/oe/build/build/angstrom-2008.1/tmp/work/x86_64-linux/openssl-native-0.9.7m-r2/openssl-0.9.7m/crypto/hmac'
| making all in crypto/ripemd...
| make[2]: Entering directory
`/build/oe/build/build/angstrom-2008.1/tmp/work/x86_64-linux/openssl-native-0.9.7m-r2/openssl-0.9.7m/crypto/ripemd'
| make[2]: Nothing to be done for `all'.
| make[2]: Leaving directory
`/build/oe/build/build/angstrom-2008.1/tmp/work/x86_64-linux/openssl-native-0.9.7m-r2/openssl-0.9.7m/crypto/ripemd'
| making all in crypto/des...
| make[2]: Entering directory
`/build/oe/build/build/angstrom-2008.1/tmp/work/x86_64-linux/openssl-native-0.9.7m-r2/openssl-0.9.7m/crypto/des'
| make[2]: Nothing to be done for `all'.
| make[2]: Leaving directory
`/build/oe/build/build/angstrom-2008.1/tmp/work/x86_64-linux/openssl-native-0.9.7m-r2/openssl-0.9.7m/crypto/des'
| making all in crypto/rc2...
| make[2]: Entering directory
`/build/oe/build/build/angstrom-2008.1/tmp/work/x86_64-linux/openssl-native-0.9.7m-r2/openssl-0.9.7m/crypto/rc2'
| make[2]: Nothing to be done for `all'.
| make[2]: Leaving directory
`/build/oe/build/build/angstrom-2008.1/tmp/work/x86_64-linux/openssl-native-0.9.7m-r2/openssl-0.9.7m/crypto/rc2'
| making all in crypto/rc4...
| make[2]: Entering directory
`/build/oe/build/build/angstrom-2008.1/tmp/work/x86_64-linux/openssl-native-0.9.7m-r2/openssl-0.9.7m/crypto/rc4'
| make[2]: Nothing to be done for `all'.
| make[2]: Leaving directory
`/build/oe/build/build/angstrom-2008.1/tmp/work/x86_64-linux/openssl-native-0.9.7m-r2/openssl-0.9.7m/crypto/rc4'
| making all in crypto/rc5...
| make[2]: Entering directory
`/build/oe/build/build/angstrom-2008.1/tmp/work/x86_64-linux/openssl-native-0.9.7m-r2/openssl-0.9.7m/crypto/rc5'
| make[2]: Nothing to be done for `all'.
| make[2]: Leaving directory
`/build/oe/build/build/angstrom-2008.1/tmp/work/x86_64-linux/openssl-native-0.9.7m-r2/openssl-0.9.7m/crypto/rc5'
| making all in crypto/idea...
| make[2]: Entering directory
`/build/oe/build/build/angstrom-2008.1/tmp/work/x86_64-linux/openssl-native-0.9.7m-r2/openssl-0.9.7m/crypto/idea'
| make[2]: Nothing to be done for `all'.
| make[2]: Leaving directory
`/build/oe/build/build/angstrom-2008.1/tmp/work/x86_64-linux/openssl-native-0.9.7m-r2/openssl-0.9.7m/crypto/idea'
| making all in crypto/bf...
| make[2]: Entering directory
`/build/oe/build/build/angstrom-2008.1/tmp/work/x86_64-linux/openssl-native-0.9.7m-r2/openssl-0.9.7m/crypto/bf'
| make[2]: Nothing to be done for `all'.
| make[2]: Leaving directory
`/build/oe/build/build/angstrom-2008.1/tmp/work/x86_64-linux/openssl-native-0.9.7m-r2/openssl-0.9.7m/crypto/bf'
| making all in crypto/cast...
| make[2]: Entering directory
`/build/oe/build/build/angstrom-2008.1/tmp/work/x86_64-linux/openssl-native-0.9.7m-r2/openssl-0.9.7m/crypto/cast'
| make[2]: Nothing to be done for `all'.
| make[2]: Leaving directory
`/build/oe/build/build/angstrom-2008.1/tmp/work/x86_64-linux/openssl-native-0.9.7m-r2/openssl-0.9.7m/crypto/cast'
| making all in crypto/bn...
| make[2]: Entering directory
`/build/oe/build/build/angstrom-2008.1/tmp/work/x86_64-linux/openssl-native-0.9.7m-r2/openssl-0.9.7m/crypto/bn'
| make[2]: Nothing to be done for `all'.
| make[2]: Leaving directory
`/build/oe/build/build/angstrom-2008.1/tmp/work/x86_64-linux/openssl-native-0.9.7m-r2/openssl-0.9.7m/crypto/bn'
| making all in crypto/ec...
| make[2]: Entering directory
`/build/oe/build/build/angstrom-2008.1/tmp/work/x86_64-linux/openssl-native-0.9.7m-r2/openssl-0.9.7m/crypto/ec'
| make[2]: Nothing to be done for `all'.
| make[2]: Leaving directory
`/build/oe/build/build/angstrom-2008.1/tmp/work/x86_64-linux/openssl-native-0.9.7m-r2/openssl-0.9.7m/crypto/ec'
| making all in crypto/rsa...
| make[2]: Entering directory
`/build/oe/build/build/angstrom-2008.1/tmp/work/x86_64-linux/openssl-native-0.9.7m-r2/openssl-0.9.7m/crypto/rsa'
| make[2]: Nothing to be done for `all'.
| make[2]: Leaving directory
`/build/oe/build/build/angstrom-2008.1/tmp/work/x86_64-linux/openssl-native-0.9.7m-r2/openssl-0.9.7m/crypto/rsa'
| making all in crypto/dsa...
| make[2]: Entering directory
`/build/oe/build/build/angstrom-2008.1/tmp/work/x86_64-linux/openssl-native-0.9.7m-r2/openssl-0.9.7m/crypto/dsa'
| make[2]: Nothing to be done for `all'.
| make[2]: Leaving directory
`/build/oe/build/build/angstrom-2008.1/tmp/work/x86_64-linux/openssl-native-0.9.7m-r2/openssl-0.9.7m/crypto/dsa'
| making all in crypto/dh...
| make[2]: Entering directory
`/build/oe/build/build/angstrom-2008.1/tmp/work/x86_64-linux/openssl-native-0.9.7m-r2/openssl-0.9.7m/crypto/dh'
| make[2]: Nothing to be done for `all'.
| make[2]: Leaving directory
`/build/oe/build/build/angstrom-2008.1/tmp/work/x86_64-linux/openssl-native-0.9.7m-r2/openssl-0.9.7m/crypto/dh'
| making all in crypto/dso...
| make[2]: Entering directory
`/build/oe/build/build/angstrom-2008.1/tmp/work/x86_64-linux/openssl-native-0.9.7m-r2/openssl-0.9.7m/crypto/dso'
| make[2]: Nothing to be done for `all'.
| make[2]: Leaving directory
`/build/oe/build/build/angstrom-2008.1/tmp/work/x86_64-linux/openssl-native-0.9.7m-r2/openssl-0.9.7m/crypto/dso'
| making all in crypto/engine...
| make[2]: Entering directory
`/build/oe/build/build/angstrom-2008.1/tmp/work/x86_64-linux/openssl-native-0.9.7m-r2/openssl-0.9.7m/crypto/engine'
| make[2]: Nothing to be done for `all'.
| make[2]: Leaving directory
`/build/oe/build/build/angstrom-2008.1/tmp/work/x86_64-linux/openssl-native-0.9.7m-r2/openssl-0.9.7m/crypto/engine'
| making all in crypto/aes...
| make[2]: Entering directory
`/build/oe/build/build/angstrom-2008.1/tmp/work/x86_64-linux/openssl-native-0.9.7m-r2/openssl-0.9.7m/crypto/aes'
| make[2]: Nothing to be done for `all'.
| make[2]: Leaving directory
`/build/oe/build/build/angstrom-2008.1/tmp/work/x86_64-linux/openssl-native-0.9.7m-r2/openssl-0.9.7m/crypto/aes'
| making all in crypto/buffer...
| make[2]: Entering directory
`/build/oe/build/build/angstrom-2008.1/tmp/work/x86_64-linux/openssl-native-0.9.7m-r2/openssl-0.9.7m/crypto/buffer'
| make[2]: Nothing to be done for `all'.
| make[2]: Leaving directory
`/build/oe/build/build/angstrom-2008.1/tmp/work/x86_64-linux/openssl-native-0.9.7m-r2/openssl-0.9.7m/crypto/buffer'
| making all in crypto/bio...
| make[2]: Entering directory
`/build/oe/build/build/angstrom-2008.1/tmp/work/x86_64-linux/openssl-native-0.9.7m-r2/openssl-0.9.7m/crypto/bio'
| make[2]: Nothing to be done for `all'.
| make[2]: Leaving directory
`/build/oe/build/build/angstrom-2008.1/tmp/work/x86_64-linux/openssl-native-0.9.7m-r2/openssl-0.9.7m/crypto/bio'
| making all in crypto/stack...
| make[2]: Entering directory
`/build/oe/build/build/angstrom-2008.1/tmp/work/x86_64-linux/openssl-native-0.9.7m-r2/openssl-0.9.7m/crypto/stack'
| make[2]: Nothing to be done for `all'.
| make[2]: Leaving directory
`/build/oe/build/build/angstrom-2008.1/tmp/work/x86_64-linux/openssl-native-0.9.7m-r2/openssl-0.9.7m/crypto/stack'
| making all in crypto/lhash...
| make[2]: Entering directory
`/build/oe/build/build/angstrom-2008.1/tmp/work/x86_64-linux/openssl-native-0.9.7m-r2/openssl-0.9.7m/crypto/lhash'
| make[2]: Nothing to be done for `all'.
| make[2]: Leaving directory
`/build/oe/build/build/angstrom-2008.1/tmp/work/x86_64-linux/openssl-native-0.9.7m-r2/openssl-0.9.7m/crypto/lhash'
| making all in crypto/rand...
| make[2]: Entering directory
`/build/oe/build/build/angstrom-2008.1/tmp/work/x86_64-linux/openssl-native-0.9.7m-r2/openssl-0.9.7m/crypto/rand'
| make[2]: Nothing to be done for `all'.
| make[2]: Leaving directory
`/build/oe/build/build/angstrom-2008.1/tmp/work/x86_64-linux/openssl-native-0.9.7m-r2/openssl-0.9.7m/crypto/rand'
| making all in crypto/err...
| make[2]: Entering directory
`/build/oe/build/build/angstrom-2008.1/tmp/work/x86_64-linux/openssl-native-0.9.7m-r2/openssl-0.9.7m/crypto/err'
| make[2]: Nothing to be done for `all'.
| make[2]: Leaving directory
`/build/oe/build/build/angstrom-2008.1/tmp/work/x86_64-linux/openssl-native-0.9.7m-r2/openssl-0.9.7m/crypto/err'
| making all in crypto/evp...
| make[2]: Entering directory
`/build/oe/build/build/angstrom-2008.1/tmp/work/x86_64-linux/openssl-native-0.9.7m-r2/openssl-0.9.7m/crypto/evp'
| make[2]: Nothing to be done for `all'.
| make[2]: Leaving directory
`/build/oe/build/build/angstrom-2008.1/tmp/work/x86_64-linux/openssl-native-0.9.7m-r2/openssl-0.9.7m/crypto/evp'
| making all in crypto/asn1...
| make[2]: Entering directory
`/build/oe/build/build/angstrom-2008.1/tmp/work/x86_64-linux/openssl-native-0.9.7m-r2/openssl-0.9.7m/crypto/asn1'
| make[2]: Nothing to be done for `all'.
| make[2]: Leaving directory
`/build/oe/build/build/angstrom-2008.1/tmp/work/x86_64-linux/openssl-native-0.9.7m-r2/openssl-0.9.7m/crypto/asn1'
| making all in crypto/pem...
| make[2]: Entering directory
`/build/oe/build/build/angstrom-2008.1/tmp/work/x86_64-linux/openssl-native-0.9.7m-r2/openssl-0.9.7m/crypto/pem'
| make[2]: Nothing to be done for `all'.
| make[2]: Leaving directory
`/build/oe/build/build/angstrom-2008.1/tmp/work/x86_64-linux/openssl-native-0.9.7m-r2/openssl-0.9.7m/crypto/pem'
| making all in crypto/x509...
| make[2]: Entering directory
`/build/oe/build/build/angstrom-2008.1/tmp/work/x86_64-linux/openssl-native-0.9.7m-r2/openssl-0.9.7m/crypto/x509'
| make[2]: Nothing to be done for `all'.
| make[2]: Leaving directory
`/build/oe/build/build/angstrom-2008.1/tmp/work/x86_64-linux/openssl-native-0.9.7m-r2/openssl-0.9.7m/crypto/x509'
| making all in crypto/x509v3...
| make[2]: Entering directory
`/build/oe/build/build/angstrom-2008.1/tmp/work/x86_64-linux/openssl-native-0.9.7m-r2/openssl-0.9.7m/crypto/x509v3'
| make[2]: Nothing to be done for `all'.
| make[2]: Leaving directory
`/build/oe/build/build/angstrom-2008.1/tmp/work/x86_64-linux/openssl-native-0.9.7m-r2/openssl-0.9.7m/crypto/x509v3'
| making all in crypto/conf...
| make[2]: Entering directory
`/build/oe/build/build/angstrom-2008.1/tmp/work/x86_64-linux/openssl-native-0.9.7m-r2/openssl-0.9.7m/crypto/conf'
| make[2]: Nothing to be done for `all'.
| make[2]: Leaving directory
`/build/oe/build/build/angstrom-2008.1/tmp/work/x86_64-linux/openssl-native-0.9.7m-r2/openssl-0.9.7m/crypto/conf'
| making all in crypto/txt_db...
| make[2]: Entering directory
`/build/oe/build/build/angstrom-2008.1/tmp/work/x86_64-linux/openssl-native-0.9.7m-r2/openssl-0.9.7m/crypto/txt_db'
| make[2]: Nothing to be done for `all'.
| make[2]: Leaving directory
`/build/oe/build/build/angstrom-2008.1/tmp/work/x86_64-linux/openssl-native-0.9.7m-r2/openssl-0.9.7m/crypto/txt_db'
| making all in crypto/pkcs7...
| make[2]: Entering directory
`/build/oe/build/build/angstrom-2008.1/tmp/work/x86_64-linux/openssl-native-0.9.7m-r2/openssl-0.9.7m/crypto/pkcs7'
| make[2]: Nothing to be done for `all'.
| make[2]: Leaving directory
`/build/oe/build/build/angstrom-2008.1/tmp/work/x86_64-linux/openssl-native-0.9.7m-r2/openssl-0.9.7m/crypto/pkcs7'
| making all in crypto/pkcs12...
| make[2]: Entering directory
`/build/oe/build/build/angstrom-2008.1/tmp/work/x86_64-linux/openssl-native-0.9.7m-r2/openssl-0.9.7m/crypto/pkcs12'
| make[2]: Nothing to be done for `all'.
| make[2]: Leaving directory
`/build/oe/build/build/angstrom-2008.1/tmp/work/x86_64-linux/openssl-native-0.9.7m-r2/openssl-0.9.7m/crypto/pkcs12'
| making all in crypto/comp...
| make[2]: Entering directory
`/build/oe/build/build/angstrom-2008.1/tmp/work/x86_64-linux/openssl-native-0.9.7m-r2/openssl-0.9.7m/crypto/comp'
| make[2]: Nothing to be done for `all'.
| make[2]: Leaving directory
`/build/oe/build/build/angstrom-2008.1/tmp/work/x86_64-linux/openssl-native-0.9.7m-r2/openssl-0.9.7m/crypto/comp'
| making all in crypto/ocsp...
| make[2]: Entering directory
`/build/oe/build/build/angstrom-2008.1/tmp/work/x86_64-linux/openssl-native-0.9.7m-r2/openssl-0.9.7m/crypto/ocsp'
| make[2]: Nothing to be done for `all'.
| make[2]: Leaving directory
`/build/oe/build/build/angstrom-2008.1/tmp/work/x86_64-linux/openssl-native-0.9.7m-r2/openssl-0.9.7m/crypto/ocsp'
| making all in crypto/ui...
| make[2]: Entering directory
`/build/oe/build/build/angstrom-2008.1/tmp/work/x86_64-linux/openssl-native-0.9.7m-r2/openssl-0.9.7m/crypto/ui'
| make[2]: Nothing to be done for `all'.
| make[2]: Leaving directory
`/build/oe/build/build/angstrom-2008.1/tmp/work/x86_64-linux/openssl-native-0.9.7m-r2/openssl-0.9.7m/crypto/ui'
| making all in crypto/krb5...
| make[2]: Entering directory
`/build/oe/build/build/angstrom-2008.1/tmp/work/x86_64-linux/openssl-native-0.9.7m-r2/openssl-0.9.7m/crypto/krb5'
| make[2]: Nothing to be done for `all'.
| make[2]: Leaving directory
`/build/oe/build/build/angstrom-2008.1/tmp/work/x86_64-linux/openssl-native-0.9.7m-r2/openssl-0.9.7m/crypto/krb5'
| make[2]: Entering directory
`/build/oe/build/build/angstrom-2008.1/tmp/work/x86_64-linux/openssl-native-0.9.7m-r2/openssl-0.9.7m'
| make[3]: Entering directory
`/build/oe/build/build/angstrom-2008.1/tmp/work/x86_64-linux/openssl-native-0.9.7m-r2/openssl-0.9.7m'
| + rm -f libcrypto.so.0
| + rm -f libcrypto.so
| + rm -f libcrypto.so.0.9.7
| libs='-L. '; for i in crypto; do \
| if [ "crypto" = "ssl" -a -n "" ]; then \
| libs=" $libs"; \
| fi; \
| ( set -x; ${FIPSLD:-gcc} -m64 \
| -shared -o lib$i.so.0.9.7 \
| -Wl,-soname=lib$i.so.0.9.7 \
| -Wl,-Bsymbolic \
| -Wl,--whole-archive lib$i.a \
| -Wl,--no-whole-archive $libs -lgcc -ldl ) || exit 1; \
| libs="-l$i $libs"; \
| done
| + gcc -m64 -shared -o libcrypto.so.0.9.7 -Wl,-soname=libcrypto.so.0.9.7
-Wl,-Bsymbolic -Wl,--whole-archive libcrypto.a -Wl,--no-whole-archive -L. -lgcc
-ldl
| /usr/bin/ld: libcrypto.a(cryptlib.o): relocation R_X86_64_32 against `a local
symbol' can not be used when making a shared object; recompile with -fPIC
| libcrypto.a(cryptlib.o): could not read symbols: Bad value
| collect2: ld returned 1 exit status
| make[3]: *** [do_gnu-shared] Error 1
| make[3]: Leaving directory
`/build/oe/build/build/angstrom-2008.1/tmp/work/x86_64-linux/openssl-native-0.9.7m-r2/openssl-0.9.7m'
| make[2]: *** [libcrypto.so.0.9.7] Error 2
| make[2]: Leaving directory
`/build/oe/build/build/angstrom-2008.1/tmp/work/x86_64-linux/openssl-native-0.9.7m-r2/openssl-0.9.7m'
| make[1]: *** [shared] Error 2
| make[1]: Leaving directory
`/build/oe/build/build/angstrom-2008.1/tmp/work/x86_64-linux/openssl-native-0.9.7m-r2/openssl-0.9.7m/crypto'
| make: *** [sub_all] Error 1
| FATAL: oe_runmake failed
NOTE: Task failed:
/build/oe/build/build/angstrom-2008.1/tmp/work/x86_64-linux/openssl-native-0.9.7m-r2/temp/log.do_compile.4915
NOTE: package openssl-native-0.9.7m-r2: task do_compile: failed
ERROR: TaskFailed event exception, aborting
NOTE: package openssl-native-0.9.7m: failed
ERROR: Build of
/build/oe/build/oe/org.openembedded.dev/packages/openssl/openssl-native_0.9.7m.bb
do_compile failed
ERROR: Task 7
(/build/oe/build/oe/org.openembedded.dev/packages/openssl/openssl-native_0.9.7m.bb,
do_compile) failed
NOTE: Tasks Summary: Attempted 170 tasks of which 170 didn't need to be rerun
and 1 failed.
ERROR:
'/build/oe/build/oe/org.openembedded.dev/packages/openssl/openssl-native_0.9.7m.bb'
failed
--
Configure bugmail: http://bugs.openembedded.net/userprefs.cgi?tab=email
------- You are receiving this mail because: -------
You are the assignee for the bug.
More information about the Openembedded-issues
mailing list