[Bug 4286] New: xfonts-xorg_6.8.bb fails to build for x86
bugzilla-daemon at amethyst.openembedded.net
bugzilla-daemon at amethyst.openembedded.net
Wed May 21 19:24:47 UTC 2008
http://bugs.openembedded.net/show_bug.cgi?id=4286
Summary: xfonts-xorg_6.8.bb fails to build for x86
Classification: Unclassified
Product: Openembedded
Version: unspecified
Platform: Other
OS/Version: other
Status: UNCONFIRMED
Severity: minor
Priority: P3
Component: org.openembedded.dev
AssignedTo: openembedded-issues at lists.openembedded.org
ReportedBy: cliff.brake at gmail.com
Host: 32bit
Machine: x86
| ccache gcc -O2 -fno-strength-reduce -ansi -pedantic -Wall -Wpointer-arith
-Wundef -I../.. -I../../exports/include -Dlinux -D__i386__
-D_POSIX_C_SOURCE=199309L -D_POSIX_SOURCE
-D_XOPEN_SOURCE -D_BSD_SOURCE -D_SVID_SOURCE
-D_GNU_SOURCE -DFUNCPROTO=15
-DNARROWPROTO -DXENVIRONMENT
-isystem/build/oe/build/build/angstrom-2008.1/tmp/staging/i486-angstrom-linux/usr/include
-c -o lexer.o lexer.c
| lexer.l:44: error: non-static declaration of 'yy_prev_more_offset' follows
static declaration
| <stdout>:811: error: previous definition of 'yy_prev_more_offset' was here
| lexer.l: In function 'yylex':
| lexer.l:350: warning: format '%lo' expects type 'long unsigned int *', but
argument 3 has type 'long int *'
| lexer.l:359: warning: format '%lx' expects type 'long unsigned int *', but
argument 3 has type 'long int *'
| make[4]: *** [lexer.o] Error 1
| make[4]: Leaving directory
`/build/oe/build/build/angstrom-2008.1/tmp/work/all-angstrom-linux/xfonts-xorg-6.8-r1/xc/config/pswrap'
| make[3]: *** [../../config/pswrap/pswrap] Error 2
| make[3]: Leaving directory
`/build/oe/build/build/angstrom-2008.1/tmp/work/all-angstrom-linux/xfonts-xorg-6.8-r1/xc/lib/dps'
| make[2]: *** [includes] Error 2
| make[2]: Leaving directory
`/build/oe/build/build/angstrom-2008.1/tmp/work/all-angstrom-linux/xfonts-xorg-6.8-r1/xc/lib'
| make[1]: *** [includes] Error 2
| make[1]: Leaving directory
`/build/oe/build/build/angstrom-2008.1/tmp/work/all-angstrom-linux/xfonts-xorg-6.8-r1/xc'
| make: *** [includes] Error 2
NOTE: Task failed:
/build/oe/build/build/angstrom-2008.1/tmp/work/all-angstrom-linux/xfonts-xorg-6.8-r1/temp/log.do_compile.1353
NOTE: package xfonts-xorg-6.8-r1: task do_compile: failed
ERROR: TaskFailed event exception, aborting
NOTE: package xfonts-xorg-6.8: failed
ERROR: Build of
/build/oe/build/oe/org.openembedded.dev/packages/xorg-font/xfonts-xorg_6.8.bb
do_compile failed
ERROR: Task 8
(/build/oe/build/oe/org.openembedded.dev/packages/xorg-font/xfonts-xorg_6.8.bb,
do_compile) failed
NOTE: Tasks Summary: Attempted 305 tasks of which 299 didn't need to be rerun
and 1 failed.
ERROR:
'/build/oe/build/oe/org.openembedded.dev/packages/xorg-font/xfonts-xorg_6.8.bb'
failed
NOTE: build 200805211510: completed
--
Configure bugmail: http://bugs.openembedded.net/userprefs.cgi?tab=email
------- You are receiving this mail because: -------
You are the assignee for the bug.
More information about the Openembedded-issues
mailing list