[Bug 4462] alsa-utils_0.1.15 fails to compile due to NLS problem (LC_ALL not defined)

bugzilla-daemon at amethyst.openembedded.net bugzilla-daemon at amethyst.openembedded.net
Thu Jul 31 17:08:44 UTC 2008


http://bugs.openembedded.net/show_bug.cgi?id=4462





--- Comment #1 from Stian Skjelstad <stian at nixia.no>  2008-07-31 19:08:43 ---
| Making all in samples
| make[2]: Entering directory
`/home/stian/moko/2007.2/build/tmp/work/armv4t-angstrom-linux-gnueabi/alsa-utils-1.0.15-r1/alsa-utils-1.0.15/speaker-test/samples'
| make[2]: Nothing to be done for `all'.
| make[2]: Leaving directory
`/home/stian/moko/2007.2/build/tmp/work/armv4t-angstrom-linux-gnueabi/alsa-utils-1.0.15-r1/alsa-utils-1.0.15/speaker-test/samples'
| make[2]: Entering directory
`/home/stian/moko/2007.2/build/tmp/work/armv4t-angstrom-linux-gnueabi/alsa-utils-1.0.15-r1/alsa-utils-1.0.15/speaker-test'
| if arm-angstrom-linux-gnueabi-gcc -march=armv4t -mtune=arm920t
-DHAVE_CONFIG_H -I. -I. -I../include -I../include 
-isystem/home/stian/moko/2007.2/build/tmp/staging/arm-angstrom-linux-gnueabi/usr/include

-isystem/home/stian/moko/2007.2/build/tmp/staging/arm-angstrom-linux-gnueabi/usr/include
-g -MT speaker-test.o -MD -MP -MF ".deps/speaker-test.Tpo" -c -o speaker-test.o
speaker-test.c; \
|       then mv -f ".deps/speaker-test.Tpo" ".deps/speaker-test.Po"; else rm -f
".deps/speaker-test.Tpo"; exit 1; fi
| speaker-test.c: In function 'main':
| speaker-test.c:767: error: 'LC_ALL' undeclared (first use in this function)
| speaker-test.c:767: error: (Each undeclared identifier is reported only once
| speaker-test.c:767: error: for each function it appears in.)
| make[2]: *** [speaker-test.o] Error 1
| make[2]: Leaving directory
`/home/stian/moko/2007.2/build/tmp/work/armv4t-angstrom-linux-gnueabi/alsa-utils-1.0.15-r1/alsa-utils-1.0.15/speaker-test'
| make[1]: *** [all-recursive] Error 1
| make[1]: Leaving directory
`/home/stian/moko/2007.2/build/tmp/work/armv4t-angstrom-linux-gnueabi/alsa-utils-1.0.15-r1/alsa-utils-1.0.15/speaker-test'
| make: *** [all-recursive] Error 1
| FATAL: oe_runmake failed

-- 
Configure bugmail: http://bugs.openembedded.net/userprefs.cgi?tab=email
------- You are receiving this mail because: -------
You are the assignee for the bug.




More information about the Openembedded-issues mailing list