[Bug 4334] dbus-native compilation fails

bugzilla-daemon at amethyst.openembedded.net bugzilla-daemon at amethyst.openembedded.net
Sat May 31 13:05:00 UTC 2008


http://bugs.openembedded.net/show_bug.cgi?id=4334





--- Comment #4 from udo <udovdh at xs4all.nl>  2008-05-31 15:05:00 ---
1.0.3 gives the same error:

 gcc -DHAVE_CONFIG_H -I. -I. -I.. -I.. -I.. -DDBUS_COMPILATION
-DDBUS_MACHINE_UUID_FILE=\"/usr/src/ipaq/angstrom-tmp//staging/var/lib/dbus/machine-id\"
-isystem/usr/src/ipaq/angstrom-tmp//staging/x86_64-linux/include
-isystem/usr/src/ipaq/angstrom-tmp//staging/x86_64-linux/include -Os -Wall
-Wchar-subscripts -Wmissing-declarations -Wmissing-prototypes -Wnested-externs
-Wpointer-arith -Wcast-align -Wsign-compare -Wdeclaration-after-statement
-fno-common -fPIC -MT dbus-sysdeps-unix.lo -MD -MP -MF
.deps/dbus-sysdeps-unix.Tpo -c dbus-sysdeps-unix.c  -fPIC -DPIC -o
.libs/dbus-sysdeps-unix.o
dbus-sysdeps-unix.c: In function '_dbus_read_credentials_unix_socket':
dbus-sysdeps-unix.c:1002: error: storage size of 'cr' isn't known
dbus-sysdeps-unix.c:1005: warning: pointer targets in passing argument 5 of
'getsockopt' differ in signedness
dbus-sysdeps-unix.c:1002: warning: unused variable 'cr'
dbus-sysdeps-unix.c: In function 'split_paths_and_append':
dbus-sysdeps-unix.c:2597: warning: passing argument 1 of
'_dbus_string_init_const' discards qualifiers from pointer target type
dbus-sysdeps-unix.c: In function '_dbus_get_standard_session_servicedirs':
dbus-sysdeps-unix.c:2766: warning: passing argument 1 of
'_dbus_string_init_const' discards qualifiers from pointer target type
make[3]: *** [dbus-sysdeps-unix.lo] Error 1
make[3]: Leaving directory
`/usr/src/ipaq/angstrom-tmp/work/x86_64-linux/dbus-native-1.0.3-r0/dbus-1.0.3/dbus'
make[2]: *** [all] Error 2
make[2]: Leaving directory
`/usr/src/ipaq/angstrom-tmp/work/x86_64-linux/dbus-native-1.0.3-r0/dbus-1.0.3/dbus'
make[1]: *** [all-recursive] Error 1
make[1]: Leaving directory
`/usr/src/ipaq/angstrom-tmp/work/x86_64-linux/dbus-native-1.0.3-r0/dbus-1.0.3'
make: *** [all] Error 2
FATAL: oe_runmake failed

-- 
Configure bugmail: http://bugs.openembedded.net/userprefs.cgi?tab=email
------- You are receiving this mail because: -------
You are the assignee for the bug.




More information about the Openembedded-issues mailing list