[Bug 4334] dbus-native compilation fails
bugzilla-daemon at amethyst.openembedded.net
bugzilla-daemon at amethyst.openembedded.net
Sat May 31 13:13:03 UTC 2008
http://bugs.openembedded.net/show_bug.cgi?id=4334
--- Comment #5 from udo <udovdh at xs4all.nl> 2008-05-31 15:13:03 ---
dbus 1.1.20:
if gcc -DHAVE_CONFIG_H -I. -I. -I.. -I..
-DDBUS_LOCALEDIR=\"/usr/src/ipaq/angstrom-tmp//staging/x86_64-linux/share/locale\"
-DDBUS_COMPILATION
-DDBUS_DAEMONDIR=\"/usr/src/ipaq/angstrom-tmp//staging/x86_64-linux/bin\"
-DDBUS_MACHINE_UUID_FILE=\""/usr/src/ipaq/angstrom-tmp//staging/var/lib/dbus/machine-id"\"
-isystem/usr/src/ipaq/angstrom-tmp//staging/x86_64-linux/include
-ffunction-sections -fdata-sections
-isystem/usr/src/ipaq/angstrom-tmp//staging/x86_64-linux/include -Os -Wall
-Wchar-subscripts -Wmissing-declarations -Wmissing-prototypes -Wnested-externs
-Wpointer-arith -Wcast-align -Wsign-compare -Wdeclaration-after-statement
-fno-common -MT dbus-launch.o -MD -MP -MF ".deps/dbus-launch.Tpo" -c -o
dbus-launch.o dbus-launch.c; \
then mv -f ".deps/dbus-launch.Tpo" ".deps/dbus-launch.Po"; else rm -f
".deps/dbus-launch.Tpo"; exit 1; fi
dbus-launch.c: In function 'main':
dbus-launch.c:969: error: 'xdisplay' undeclared (first use in this function)
dbus-launch.c:969: error: (Each undeclared identifier is reported only once
dbus-launch.c:969: error: for each function it appears in.)
dbus-launch.c:1086: warning: unused variable 'ret2'
make[2]: *** [dbus-launch.o] Error 1
make[2]: Leaving directory
`/usr/src/ipaq/angstrom-tmp/work/x86_64-linux/dbus-native-1.1.20-r0/dbus-1.1.20/tools'
make[1]: *** [all-recursive] Error 1
make[1]: Leaving directory
`/usr/src/ipaq/angstrom-tmp/work/x86_64-linux/dbus-native-1.1.20-r0/dbus-1.1.20'
make: *** [all] Error 2
FATAL: oe_runmake failed
--
Configure bugmail: http://bugs.openembedded.net/userprefs.cgi?tab=email
------- You are receiving this mail because: -------
You are the assignee for the bug.
More information about the Openembedded-issues
mailing list